{"text_format":"1","workbook":"xlsx","n_sheets":4,"sheets":["1r","1left","1right","定数表"],"not_rendered":{"charts":0,"images":0,"macros":0,"external_links":0,"defined_names":1,"comments":0,"pivot_tables":0},"unopened":[],"bounds":{"document_bytes":16777216,"sheet_cells":100000,"rows_first":2000,"rows_last":500,"rows_between":2000,"halvings":0,"cell_chars":16384,"cell_head_chars":4096},"cells_cut":0,"cells_raw":0,"read":"whole","date_system":"1900"}

{"sheet":"1r","index":0,"n_rows":161,"n_cols":35,"rows_kept":161,"cut":false,"hidden":false,"merged":[]}
["5'","なし",null,null,null,null,null,null,null,null,null,null,null,null,null,null,null,null,null,null,null,null,null,null,null,null,null,null,null,null,null,null,"ave","mono","selected"]
["3'","-p",null,null,null,null,"UCÇ◊AUK",null,null,null,null,null,null,null,null,null,null,null,null,null,null,null,null,null,null,null,null,null,null,null,null,"H",1.0079400000000001,1.0078199999999999,{"$f":"IF(OR($P$4=\"ave\",$P$4=\"ave>p\"),AG2,AH2)","v":1.0078199999999999}]
[null,null,null,null,null,null,-1,"から表示",null,null,null,null,null,null,null,null,"-H+",null,null,null,null,null,null,null,null,null,null,null,null,null,null,"Na",22.989799999999999,22.989799999999999,22.989799999999999]
[null,null,null,null,null,null,null,null,null,null,null,null,null,null,null,"mono","a","3'-OH-H2O",null,null,"b","3'-OH",null,null,"c","3'-p -H2O",null,null,"d","3'-p",null,"K",39.098300000000002,38.963700000000003,38.963700000000003]
[null,null,"No.","No.","列","position","position","fragment","ave","ave>p","mono","mono>p","top","top>p",null,{"$f":"IF(P4=\"ave\",0,IF(P4=\"ave>p\",0.5,IF(P4=\"mono\",1,IF(P4=\"mono>p\",1.5,IF(P4=\"top\",2,2.5)))))","v":1},{"$f":"$G$3","v":-1},{"$f":"Q5-1","v":-2},{"$f":"R5-1","v":-3},null,{"$f":"$G$3","v":-1},{"$f":"U5-1","v":-2},{"$f":"V5-1","v":-3},null,{"$f":"$G$3","v":-1},{"$f":"Y5-1","v":-2},{"$f":"Z5-1","v":-3},null,{"$f":"$G$3","v":-1},{"$f":"AC5-1","v":-2},{"$f":"AD5-1","v":-3},"CE",53.062660000000001,53.02655,53.02655]
[null,null,{"$f":"IF(ISNUMBER(F6),1,\"\")","v":1},1,{"$f":"IF(ISNUMBER(MATCH(D6,INDIRECT($A$7&\"!q$7:q$67\"),0)),MATCH(D6,INDIRECT($A$7&\"!q$7:q$67\"),0),\"\")","v":7},{"$f":"IF(ISNUMBER($E6),INDEX(INDIRECT($A$7&\"!h$7:h$66\"),$E6,1),\"\")","v":6},{"$f":"IF(ISNUMBER($E6),INDEX(INDIRECT($A$7&\"!i$7:i$66\"),$E6,1),\"\")","v":"1 : 1"},{"$f":"IF(ISNUMBER($E6),INDEX(INDIRECT($A$7&\"!f$7:f$66\"),$E6,1),\"\")","v":"Up"},{"$f":"IF(ISNUMBER($E6),INDEX(INDIRECT($A$7&\"!k$7:k$66\"),$E6,1),\"\")","v":324.18128200000001},{"$f":"IF(ISNUMBER($E6),INDEX(INDIRECT($A$7&\"!l$7:l$66\"),$E6,1),\"\")","v":306.16600199999999},{"$f":"IF(ISNUMBER($E6),INDEX(INDIRECT($A$7&\"!m$7:m$66\"),$E6,1),\"\")","v":324.03586652019999},{"$f":"IF(ISNUMBER($E6),INDEX(INDIRECT($A$7&\"!n$7:n$66\"),$E6,1),\"\")","v":306.02530183409999},{"$f":"IF(ISNUMBER($E6),INDEX(INDIRECT($A$7&\"!o$7:o$66\"),$E6,1),\"\")","v":324.03586652019999},{"$f":"IF(ISNUMBER($E6),INDEX(INDIRECT($A$7&\"!p$7:p$66\"),$E6,1),\"\")","v":306.02530183409999},null,{"$f":"IF(ISNUMBER($E6),(IF(ISNUMBER($E7),OFFSET($I6,0,INT($P$5)*2)-$AI$6-$AI$7,IF($B$2=\"なし\",OFFSET($I6,0,INT($P$5)*2)-$AI$7,OFFSET($I6,0,INT($P$5)*2)-$AI$6-$AI$7))),\"\")","v":226.05897652019999},{"$f":"IF(ISNUMBER($P6),($P6+Q$5*$AI$2)/(-1*Q$5),\"\")","v":225.05115652019998},112.0216682601,74.345172173400002,{"$f":"IF(ISNUMBER(P6),P6+$AI$7,\"\")","v":244.06953652019999},{"$f":"IF(ISNUMBER($T6),($T6+U$5*$AI$2)/(-1*U$5),\"\")","v":243.06171652019998},121.0269482601,80.348692173399996,{"$f":"IF(ISNUMBER($E6),(IF(ISNUMBER($E7),OFFSET($I6,0,INT($P$5)*2)-$AI$7,IF($B$2=\"なし\",\"\",OFFSET($I6,0,INT($P$5)*2)-$AI$7))),\"\")","v":306.02530652019999},{"$f":"IF(ISNUMBER($X6),($X6+Y$5*$AI$2)/(-1*Y$5),\"\")","v":305.01748652020001},152.00483326009999,101.00061550673333,{"$f":"IF(ISNUMBER(X6),X6+$AI$7,\"\")","v":324.03586652019999},{"$f":"IF(ISNUMBER($AB6),($AB6+AC$5*$AI$2)/(-1*AC$5),\"\")","v":323.02804652020001},161.01011326009998,107.00413550673333,"HPO3",79.979900000000001,79.966329999999999,79.966329999999999]
["1left",null,{"$f":"IF(ISNUMBER(F7),C6+1,\"\")","v":2},2,{"$f":"IF(ISNUMBER(MATCH(D7,INDIRECT($A$7&\"!q$7:q$67\"),0)),MATCH(D7,INDIRECT($A$7&\"!q$7:q$67\"),0),\"\")","v":6},{"$f":"IF(ISNUMBER($E7),INDEX(INDIRECT($A$7&\"!h$7:h$66\"),$E7,1),\"\")","v":5},{"$f":"IF(ISNUMBER($E7),INDEX(INDIRECT($A$7&\"!i$7:i$66\"),$E7,1),\"\")","v":"1 : 2"},{"$f":"IF(ISNUMBER($E7),INDEX(INDIRECT($A$7&\"!f$7:f$66\"),$E7,1),\"\")","v":"UCp"},{"$f":"IF(ISNUMBER($E7),INDEX(INDIRECT($A$7&\"!k$7:k$66\"),$E7,1),\"\")","v":629.36252400000001},{"$f":"IF(ISNUMBER($E7),INDEX(INDIRECT($A$7&\"!l$7:l$66\"),$E7,1),\"\")","v":611.34724400000005},{"$f":"IF(ISNUMBER($E7),INDEX(INDIRECT($A$7&\"!m$7:m$66\"),$E7,1),\"\")","v":629.07715277130001},{"$f":"IF(ISNUMBER($E7),INDEX(INDIRECT($A$7&\"!n$7:n$66\"),$E7,1),\"\")","v":611.06658808520001},{"$f":"IF(ISNUMBER($E7),INDEX(INDIRECT($A$7&\"!o$7:o$66\"),$E7,1),\"\")","v":629.07715277130001},{"$f":"IF(ISNUMBER($E7),INDEX(INDIRECT($A$7&\"!p$7:p$66\"),$E7,1),\"\")","v":611.06658808520001},null,531.10026277129998,530.09244277129994,264.54231138565001,176.02560092376666,{"$f":"IF(ISNUMBER(P7),P7+$AI$7,\"\")","v":549.11082277130004},548.1030027713,273.54759138565004,182.02912092376667,611.06659277129995,610.05877277129991,304.52547638564999,202.68104425709998,{"$f":"IF(ISNUMBER(X7),X7+$AI$7,\"\")","v":629.07715277130001},628.06933277129997,313.53075638565002,208.68456425709999,"H2O",18.015280000000001,18.010560000000002,18.010560000000002]
["1right",null,{"$f":"IF(ISNUMBER(F8),C7+1,\"\")","v":3},3,5,4,"1 : 3","UCÇp",883.49702600000001,865.48174600000004,883.10753998309997,865.09697529699997,883.10753998309997,865.09697529699997,null,785.13064998309994,784.1228299830999,391.55750499154999,260.70239666103333,803.1412099831,802.13338998309996,400.56278499155002,266.70591666103331,865.09697998309991,864.08915998309988,431.54066999154998,287.35783999436666,883.10753998309997,882.09971998309993,440.54594999155,293.36135999436664,"CH2",14.026579999999999,14.015650000000001,14.015650000000001]
[null,null,4,4,4,3,"1 : 4","UCÇ◊p",1247.699108,1229.6838279999999,1247.1383211256,1229.1277564395,1247.1383211256,1229.1277564395,null,1149.1614311256001,1148.1536111256,573.5728955628,382.04599037520001,1167.1719911256,1166.1641711256,582.57817556279997,388.04951037520004,1229.1277611256,1228.1199411256,613.55606056279998,408.70143370853339,1247.1383211256,1246.1305011255999,622.56134056279996,414.70495370853331]
[null,null,5,5,3,2,"1 : 5","UCÇ◊Ap",1576.9050499999998,1558.8897699999998,1576.1908407691999,1558.1802760830999,1576.1908407691999,1558.1802760830999,null,1478.2139507692,1477.2061307691999,738.09915538459995,491.73016358973337,1496.2245107691999,1495.2166907691999,747.10443538459992,497.73368358973329,1558.1802807692,1557.1724607691999,778.08232038459994,518.38560692306658,1576.1908407691999,1575.1830207691999,787.08760038459991,524.38912692306667]
{"$rows_left_out":152}
{"sheet":"1left","index":1,"n_rows":66,"n_cols":99,"rows_kept":66,"cut":false,"hidden":false,"merged":[]}
["1r","5'","3'",null,null,null,null,null,{"$f":"'1r'!G1","v":0}]
[null,{"$f":"'1r'!B1","v":"なし"},{"$f":"'1r'!B2","v":"-p"},null,null,null,null,null,{"$f":"UPPER(SUBSTITUTE('1r'!G2,\" \",\"\"))","v":"UCÇ◊AUK"}]
[null,{"$f":"IF(B2=\"p-\",1,0)","v":0},{"$f":"IF(C2=\"-p\",0,-1)","v":0},null,null,null,null,null,null,null,null,null,null,null,null,null,null,null,null,null,null,null,null,null,null,null,null,null,null,null,null,null,null,null,null,null,null,null,null,null,null,null,null,null,null,null,null,null,null,null,null,null,null,null,null,null,null,null,null,null,null,null,null,null,null,null,null,null,null,null,null,null,null,null,null,null,"ユーザー用塩基",null,null,null,null,null,null,null,null,null,null,null,null,null,null,null,null,null,null,null,"HPO3"]
[null,null,null,null,null,null,null,null,null,null,null,null,null,null,"topの適当な予想値",null,"順位","小さい順","同点","C","U","T","A","G","^",":","#","°","~",")","\\","J","B","=","/","\"","+","*","`","'",",","|","{","[","]",">","?","%","$","!",1,2,3,4,5,6,7,8,9,"D","E","F","I","K","L","M","O","P","Q","R","S","V","W","X","Y","Z","N","}","&","@","H","(","À","Á","Â","Ã","Ä","Å","Æ","∝","Ç","◊","Ò","Õ","Ï","Ñ","-p",">p","H2O"]
[null,null,null,null,null,null,null,"position","position","fragment","ave","ave>p","mono","mono>p","top","top>p",null,null,null,243.21662000000003,244.20138,258.22796,267.24131999999997,283.24072000000001,479.33584200000007,281.2679,297.26730000000003,285.25330000000002,315.27927999999997,345.30525999999998,272.25454000000002,258.22796,257.2432,281.2679,281.2679,281.2679,335.35834,381.44991999999996,351.35774000000004,257.2432,332.26343999999995,325.32045999999997,287.26918000000001,458.44628,258.22796,271.22672,257.2432,259.28222000000005,347.34427999999997,331.27868000000001,316.26403999999997,260.26697999999999,332.32963999999998,260.26697999999999,274.22735999999998,412.35470000000004,297.26730000000003,571.53441999999995,571.53441999999995,246.21725999999998,426.38128,274.29356000000001,268.22608000000002,297.26730000000003,297.26730000000003,285.25330000000002,282.25266000000005,244.20138,409.39382000000001,311.29388,303.33478000000002,318.23685999999998,540.48062000000004,345.30525999999998,508.48181999999997,258.22796,{"$f":"INDIRECT(A1&\"!B12\")","v":273.24259999999998},371.38890000000004,301.2527,381.35895999999997,397.42455999999999,324.29264000000001,335.31528000000003,349.34186000000005,295.29448000000002,359.33184,273.24259999999998,287.26918000000001,341.36292000000003,260.20078000000001,192.16988000000001,302.23746,271.26978000000003,258.22796,394.33942000000002,287.22612000000004,79.979901999999996,61.964621999999991,18.015280000000001]
[null,null,null,"5'","3'","fragment",null,0,null,null,null,null,null,null,null,null,null,null,null,243.08552054839998,244.06953613140001,258.08518619519998,267.09675394089999,283.09166856320002,479.10534307410001,281.11240400470001,297.10731862699998,285.09608523449998,315.10664992059998,345.11721460669997,272.100836259,258.08518619519998,257.10117061220001,281.11240400470001,281.11240400470001,281.11240400470001,335.15935419610003,381.14707498989998,351.1542688184,257.10117061220001,332.08558012589998,325.13861875459997,287.1117352983,458.12198245460002,258.08518619519998,271.08043517070001,257.10117061220001,259.0626766561,347.07872065059996,331.10156454290001,316.09066550360001,260.04669223909997,332.06782161129996,260.04669223909997,274.08010081750001,412.13426166080001,297.10731862699998,571.21257155730007,571.21257155730007,246.08518619519998,426.14991172460003,274.06234230289999,268.08076952390002,297.10731862699998,297.10731862699998,285.09608523449998,282.09641958769998,244.06953613140001,409.15974812679997,311.12296869080001,303.08889140599996,318.06993006209996,540.18160578289996,345.11721460669997,508.19177653829996,258.08518619519998,{"$f":"INDIRECT(A1&\"!B13\")","v":273.09608523449998},371.18048356829996,301.09099985680001,381.08419995899993,397.0613560667,324.11821766629998,335.12296869080001,349.13861875459997,295.12805406849998,359.1328646705,273.09608523449998,287.1117352983,341.16991888219997,260.06445075369999,192.07462150909998,302.07501543979998,271.11682067599997,258.08518619519998,394.12369697469995,287.07534979299999,79.966330388800003,61.955765702700006,18.0105646861]
[null,{"$f":"$B$3","v":0},{"$f":"$C$3","v":0},{"$f":"IF($B$3=1,\"p\",\"\")","v":""},{"$f":"IF($C$3=0,\"p\",\"\")","v":"p"},{"$f":"D7&J7&E7","v":"UCÇ◊AUKp"},null,0,{"$f":"\"1 : \"&(LEN($I$2)-H7)","v":"1 : 7"},{"$f":"LEFT($I$2,LEN($I$2)-H7)","v":"UCÇ◊AUK"},{"$f":"IF(LEN(J7)=0,\"\",SUMPRODUCT(T$5:CU$5,T7:CU7))","v":2242.3029740000002},{"$f":"IF(C7=-1,\"\",K7-18.01528)","v":2224.2876940000001},{"$f":"IF(LEN(J7)=0,\"\",SUMPRODUCT(T$6:CU$6,T7:CU7))","v":2241.2792269329998},{"$f":"IF(C7=-1,\"\",M7-18.0105646861)","v":2223.2686622468996},{"$f":"IF(LEN(J7)=0,\"\",M7+TRUNC(K7-M7-0.1))","v":2241.2792269329998},{"$f":"IF(C7=-1,\"\",O7-18.0105646861)","v":2223.2686622468996},{"$f":"IF(ISNUMBER(K7),R7+S7,\"\")","v":7},{"$f":"IF(ISNUMBER(K7),COUNTIF(K$7:K$66,\"<\"&K7)+1,\"\")","v":7},{"$f":"IF(ISNUMBER(K7),COUNTIF(K$7:K7,\"=\"&K7)-1,\"\")","v":0},{"$f":"LEN($J7)-LEN(SUBSTITUTE($J7,T$4,\"\"))","v":1},2,0,1,0,0,0,0,0,0,{"$f":"LEN($J7)-LEN(SUBSTITUTE($J7,AD$4,\"\"))","v":0},0,0,0,0,0,0,0,0,0,{"$f":"LEN($J7)-LEN(SUBSTITUTE($J7,AN$4,\"\"))","v":0},0,0,0,0,0,0,0,0,0,{"$f":"LEN($J7)-LEN(SUBSTITUTE($J7,AX$4,\"\"))","v":0},0,0,0,0,0,0,0,0,0,{"$f":"LEN($J7)-LEN(SUBSTITUTE($J7,BH$4,\"\"))","v":0},0,0,0,1,0,0,0,0,0,{"$f":"LEN($J7)-LEN(SUBSTITUTE($J7,BR$4,\"\"))","v":0},0,0,0,0,0,0,0,0,0,0,0,0,0,0,0,{"$f":"LEN($J7)-LEN(SUBSTITUTE($J7,CH$4,\"\"))","v":0},0,0,0,0,1,1,0,0,0,{"$f":"LEN($J7)-LEN(SUBSTITUTE($J7,CR$4,\"\"))","v":0},{"$f":"LEN(J7)+B7+C7","v":7},null,{"$f":"-(LEN(J7)-1)","v":-6}]
[null,{"$f":"$B$3","v":0},0,{"$f":"IF($B$3=1,\"p\",\"\")","v":""},"p",{"$f":"D8&J8&E8","v":"UCÇ◊AUp"},null,1,{"$f":"\"1 : \"&(LEN($I$2)-H8)","v":"1 : 6"},{"$f":"LEFT($I$2,LEN($I$2)-H8)","v":"UCÇ◊AU"},1883.0710520000002,{"$f":"IF(C8=-1,\"\",K8-18.01528)","v":1865.0557720000002},1882.2161426032999,{"$f":"IF(C8=-1,\"\",M8-18.0105646861)","v":1864.2055779171999},{"$f":"IF(LEN(J8)=0,\"\",M8+TRUNC(K8-M8-0.1))","v":1882.2161426032999},{"$f":"IF(C8=-1,\"\",O8-18.0105646861)","v":1864.2055779171999},{"$f":"IF(ISNUMBER(K8),R8+S8,\"\")","v":6},{"$f":"IF(ISNUMBER(K8),COUNTIF(K$7:K$66,\"<\"&K8)+1,\"\")","v":6},{"$f":"IF(ISNUMBER(K8),COUNTIF(K$7:K8,\"=\"&K8)-1,\"\")","v":0},1,2,0,1,0,0,0,0,0,0,0,0,0,0,0,0,0,0,0,0,0,0,0,0,0,0,0,0,0,0,0,0,0,0,0,0,0,0,0,0,0,0,0,0,0,0,0,0,0,0,0,0,0,0,0,0,0,0,0,0,0,0,0,0,0,0,0,0,0,0,0,1,1,0,0,0,0,6,null,-5]
[null,0,0,"","p","UCÇ◊Ap",null,2,"1 : 5","UCÇ◊A",1576.9050499999998,1558.8897699999998,1576.1908407691999,1558.1802760830999,1576.1908407691999,1558.1802760830999,5,5,{"$f":"IF(ISNUMBER(K9),COUNTIF(K$7:K9,\"=\"&K9)-1,\"\")","v":0},1,1,0,1,0,0,0,0,0,0,0,0,0,0,0,0,0,0,0,0,0,0,0,0,0,0,0,0,0,0,0,0,0,0,0,0,0,0,0,0,0,0,0,0,0,0,0,0,0,0,0,0,0,0,0,0,0,0,0,0,0,0,0,0,0,0,0,0,0,0,0,1,1,0,0,0,0,5,null,-4]
[null,0,0,"","p","UCÇ◊p",null,3,"1 : 4","UCÇ◊",1247.699108,1229.6838279999999,1247.1383211256,1229.1277564395,1247.1383211256,1229.1277564395,4,4,{"$f":"IF(ISNUMBER(K10),COUNTIF(K$7:K10,\"=\"&K10)-1,\"\")","v":0},1,1,0,0,0,0,0,0,0,0,0,0,0,0,0,0,0,0,0,0,0,0,0,0,0,0,0,0,0,0,0,0,0,0,0,0,0,0,0,0,0,0,0,0,0,0,0,0,0,0,0,0,0,0,0,0,0,0,0,0,0,0,0,0,0,0,0,0,0,0,0,1,1,0,0,0,0,4,null,-3]
{"$rows_left_out":57}
{"sheet":"1right","index":2,"n_rows":66,"n_cols":99,"rows_kept":66,"cut":false,"hidden":false,"merged":[]}
["1r","5'","3'",null,null,null,null,null,{"$f":"'1r'!G1","v":0}]
[null,{"$f":"'1r'!B1","v":"なし"},{"$f":"'1r'!B2","v":"-p"},null,null,null,null,null,{"$f":"UPPER(SUBSTITUTE('1r'!G2,\" \",\"\"))","v":"UCÇ◊AUK"}]
[null,{"$f":"IF(B2=\"p-\",1,0)","v":0},{"$f":"IF(C2=\"-p\",0,-1)","v":0},null,null,null,null,null,null,null,null,null,null,null,null,null,null,null,null,null,null,null,null,null,null,null,null,null,null,null,null,null,null,null,null,null,null,null,null,null,null,null,null,null,null,null,null,null,null,null,null,null,null,null,null,null,null,null,null,null,null,null,null,null,null,null,null,null,null,null,null,null,null,null,null,null,"ユーザー用塩基",null,null,null,null,null,null,null,null,null,null,null,null,null,null,null,null,null,null,null,"HPO3"]
[null,null,null,null,null,null,null,null,null,null,null,null,null,null,"topの適当な予想値",null,"順位","小さい順","同点","C","U","T","A","G","^",":","#","°","~",")","\\","J","B","=","/","\"","+","*","`","'",",","|","{","[","]",">","?","%","$","!",1,2,3,4,5,6,7,8,9,"D","E","F","I","K","L","M","O","P","Q","R","S","V","W","X","Y","Z","N","}","&","@","H","(","À","Á","Â","Ã","Ä","Å","Æ","∝","Ç","◊","Ò","Õ","Ï","Ñ","-p",">p","H2O"]
[null,null,null,null,null,null,null,"position","position","fragment","ave","ave>p","mono","mono>p","top","top>p",null,null,null,243.21662000000003,244.20138,258.22796,267.24131999999997,283.24072000000001,479.33584200000007,281.2679,297.26730000000003,285.25330000000002,315.27927999999997,345.30525999999998,272.25454000000002,258.22796,257.2432,281.2679,281.2679,281.2679,335.35834,381.44991999999996,351.35774000000004,257.2432,332.26343999999995,325.32045999999997,287.26918000000001,458.44628,258.22796,271.22672,257.2432,259.28222000000005,347.34427999999997,331.27868000000001,316.26403999999997,260.26697999999999,332.32963999999998,260.26697999999999,274.22735999999998,412.35470000000004,297.26730000000003,571.53441999999995,571.53441999999995,246.21725999999998,426.38128,274.29356000000001,268.22608000000002,297.26730000000003,297.26730000000003,285.25330000000002,282.25266000000005,244.20138,409.39382000000001,311.29388,303.33478000000002,318.23685999999998,540.48062000000004,345.30525999999998,508.48181999999997,258.22796,{"$f":"INDIRECT(A1&\"!B12\")","v":273.24259999999998},371.38890000000004,301.2527,381.35895999999997,397.42455999999999,324.29264000000001,335.31528000000003,349.34186000000005,295.29448000000002,359.33184,273.24259999999998,287.26918000000001,341.36292000000003,260.20078000000001,192.16988000000001,302.23746,271.26978000000003,258.22796,394.33942000000002,287.22612000000004,79.979901999999996,61.964621999999991,18.015280000000001]
[null,null,null,"5'","3'","fragment",null,0,null,null,null,null,null,null,null,null,null,null,null,243.08552054839998,244.06953613140001,258.08518619519998,267.09675394089999,283.09166856320002,479.10534307410001,281.11240400470001,297.10731862699998,285.09608523449998,315.10664992059998,345.11721460669997,272.100836259,258.08518619519998,257.10117061220001,281.11240400470001,281.11240400470001,281.11240400470001,335.15935419610003,381.14707498989998,351.1542688184,257.10117061220001,332.08558012589998,325.13861875459997,287.1117352983,458.12198245460002,258.08518619519998,271.08043517070001,257.10117061220001,259.0626766561,347.07872065059996,331.10156454290001,316.09066550360001,260.04669223909997,332.06782161129996,260.04669223909997,274.08010081750001,412.13426166080001,297.10731862699998,571.21257155730007,571.21257155730007,246.08518619519998,426.14991172460003,274.06234230289999,268.08076952390002,297.10731862699998,297.10731862699998,285.09608523449998,282.09641958769998,244.06953613140001,409.15974812679997,311.12296869080001,303.08889140599996,318.06993006209996,540.18160578289996,345.11721460669997,508.19177653829996,258.08518619519998,{"$f":"INDIRECT(A1&\"!B13\")","v":273.09608523449998},371.18048356829996,301.09099985680001,381.08419995899993,397.0613560667,324.11821766629998,335.12296869080001,349.13861875459997,295.12805406849998,359.1328646705,273.09608523449998,287.1117352983,341.16991888219997,260.06445075369999,192.07462150909998,302.07501543979998,271.11682067599997,258.08518619519998,394.12369697469995,287.07534979299999,79.966330388800003,61.955765702700006,18.0105646861]
[null,{"$f":"$B$3","v":0},{"$f":"$C$3","v":0},{"$f":"IF($B$3=1,\"p\",\"\")","v":""},{"$f":"IF($C$3=0,\"p\",\"\")","v":"p"},{"$f":"D7&J7&E7","v":"UCÇ◊AUKp"},null,0,{"$f":"(H7+1&\" : \"&(LEN($I$2)))","v":"1 : 7"},{"$f":"RIGHT($I$2,LEN($I$2)-H7)","v":"UCÇ◊AUK"},{"$f":"IF(LEN(J7)=0,\"\",SUMPRODUCT(T$5:CU$5,T7:CU7))","v":2242.3029740000002},{"$f":"IF(C7=-1,\"\",K7-18.01528)","v":2224.2876940000001},{"$f":"IF(LEN(J7)=0,\"\",SUMPRODUCT(T$6:CU$6,T7:CU7))","v":2241.2792269329998},{"$f":"IF(C7=-1,\"\",M7-18.0105646861)","v":2223.2686622468996},{"$f":"IF(LEN(J7)=0,\"\",M7+TRUNC(K7-M7-0.1))","v":2241.2792269329998},{"$f":"IF(C7=-1,\"\",O7-18.0105646861)","v":2223.2686622468996},{"$f":"IF(ISNUMBER(K7),R7+S7,\"\")","v":7},{"$f":"IF(ISNUMBER(K7),COUNTIF(K$7:K$66,\"<\"&K7)+1,\"\")","v":7},{"$f":"IF(ISNUMBER(K7),COUNTIF(K$7:K7,\"=\"&K7)-1,\"\")","v":0},{"$f":"LEN($J7)-LEN(SUBSTITUTE($J7,T$4,\"\"))","v":1},2,0,1,0,0,0,0,0,0,{"$f":"LEN($J7)-LEN(SUBSTITUTE($J7,AD$4,\"\"))","v":0},0,0,0,0,0,0,0,0,0,{"$f":"LEN($J7)-LEN(SUBSTITUTE($J7,AN$4,\"\"))","v":0},0,0,0,0,0,0,0,0,0,{"$f":"LEN($J7)-LEN(SUBSTITUTE($J7,AX$4,\"\"))","v":0},0,0,0,0,0,0,0,0,0,{"$f":"LEN($J7)-LEN(SUBSTITUTE($J7,BH$4,\"\"))","v":0},0,0,0,1,0,0,0,0,0,{"$f":"LEN($J7)-LEN(SUBSTITUTE($J7,BR$4,\"\"))","v":0},0,0,0,0,0,0,0,0,0,0,0,0,0,0,0,{"$f":"LEN($J7)-LEN(SUBSTITUTE($J7,CH$4,\"\"))","v":0},0,0,0,0,1,1,0,0,0,{"$f":"LEN($J7)-LEN(SUBSTITUTE($J7,CR$4,\"\"))","v":0},{"$f":"LEN(J7)+B7+C7","v":7},null,{"$f":"-(LEN(J7)-1)","v":-6}]
[null,null,{"$f":"$C$3","v":0},null,{"$f":"IF($C$3=0,\"p\",\"\")","v":"p"},{"$f":"D8&J8&E8","v":"CÇ◊AUKp"},null,1,{"$f":"(H8+1&\" : \"&(LEN($I$2)))","v":"2 : 7"},{"$f":"RIGHT($I$2,LEN($I$2)-H8)","v":"CÇ◊AUK"},1936.136972,{"$f":"IF(C8=-1,\"\",K8-18.01528)","v":1918.1216919999999},1935.2539250988998,{"$f":"IF(C8=-1,\"\",M8-18.0105646861)","v":1917.2433604127998},1935.2539250988998,{"$f":"IF(C8=-1,\"\",O8-18.0105646861)","v":1917.2433604127998},6,6,{"$f":"IF(ISNUMBER(K8),COUNTIF(K$7:K8,\"=\"&K8)-1,\"\")","v":0},1,1,0,1,0,0,0,0,0,0,0,0,0,0,0,0,0,0,0,0,0,0,0,0,0,0,0,0,0,0,0,0,0,0,0,0,0,0,0,0,0,0,0,0,1,0,0,0,0,0,0,0,0,0,0,0,0,0,0,0,0,0,0,0,0,0,0,0,0,0,0,1,1,0,0,0,0,6,null,-5]
[null,null,0,null,"p","Ç◊AUKp",null,2,"3 : 7","Ç◊AUK",1630.9557299999999,1612.9404499999998,1630.2126388478,1612.2020741617,1630.2126388478,1612.2020741617,5,5,{"$f":"IF(ISNUMBER(K9),COUNTIF(K$7:K9,\"=\"&K9)-1,\"\")","v":0},0,1,0,1,0,0,0,0,0,0,0,0,0,0,0,0,0,0,0,0,0,0,0,0,0,0,0,0,0,0,0,0,0,0,0,0,0,0,0,0,0,0,0,0,1,0,0,0,0,0,0,0,0,0,0,0,0,0,0,0,0,0,0,0,0,0,0,0,0,0,0,1,1,0,0,0,0,5,null,-4]
[null,null,0,null,"p","◊AUKp",null,3,"4 : 7","◊AUK",1376.821228,1358.8059479999999,1376.182251636,1358.1716869499,1376.182251636,1358.1716869499,4,4,{"$f":"IF(ISNUMBER(K10),COUNTIF(K$7:K10,\"=\"&K10)-1,\"\")","v":0},0,1,0,1,0,0,0,0,0,0,0,0,0,0,0,0,0,0,0,0,0,0,0,0,0,0,0,0,0,0,0,0,0,0,0,0,0,0,0,0,0,0,0,0,1,0,0,0,0,0,0,0,0,0,0,0,0,0,0,0,0,0,0,0,0,0,0,0,0,0,0,0,1,0,0,0,0,4,null,-3]
{"$rows_left_out":57}
{"sheet":"定数表","index":3,"n_rows":79,"n_cols":9,"rows_kept":79,"cut":false,"hidden":false,"merged":[]}
[]
[null,null,"慣用表記","1文字","average","mono isotopic"]
[null,null,"C","C",243.21662000000003,243.08552054839998,null,"N","ユーザー定義"]
[null,null,"U","U",244.20138,244.06953613140001]
[null,null,"T","T",258.22796,258.08518619519998]
[null,null,"A","A",267.24131999999997,267.09675394089999]
[null,null,"G","G",283.24072000000001,283.09166856320002]
[null,null,"Ar(p)","^",479.33584200000007,479.10534307410001,null,"特殊文字"]
[null,null,"Am",":",281.2679,281.11240400470001,null,"~, ?, *を検索するときは~でエスケープしたクエリを投げる必要がある。"]
[null,null,"Gm","#",297.26730000000003,297.10731862699998]
{"$rows_left_out":69}