{"text_format":"1","workbook":"xlsx","n_sheets":4,"sheets":["1r","1","Nucleoside table","tables"],"not_rendered":{"charts":0,"images":0,"macros":1,"external_links":0,"defined_names":1,"comments":1,"pivot_tables":0},"unopened":[],"bounds":{"document_bytes":16777216,"sheet_cells":100000,"rows_first":2000,"rows_last":500,"rows_between":2000,"halvings":0,"cell_chars":16384,"cell_head_chars":4096},"cells_cut":0,"cells_raw":0,"read":"whole","date_system":"1900"}

{"sheet":"1r","index":0,"n_rows":650,"n_cols":48,"rows_kept":650,"cut":false,"hidden":false,"merged":[[3,8,3,9],[38,0,38,1]]}
["5'","p-",null,null,null,null,">test",null,"↓second sequence",null,null,null,null,null,null,null,null,null,null,null,null,null,null,null,null,null,null,null,null,null,null,null,null,null,null,null,"ave","mono","selected"]
["3'","-OH",null,null,null,null,"UGCCUQUC/CGCA",null,null,null,null,null,null,null,null,null,null,null,null,null,null,null,null,null,null,null,null,null,null,null,null,null,null,null,null,"H",1.0079400000000001,1.0078250318999999,{"$f":"IF(OR($P$4=\"ave\",$P$4=\"ave>p\"),AK2,AL2)","v":1.0078250318999999},null,null,null,2,3,"+1","+2","+3"]
["Cut at","G,L,I",null,null,null,null,null,null,"Negative",1,{"$f":"IF(I3=\"Positive\",1,-1)","v":-1},{"$f":"IF(I3=\"Positive\",\"+\",\"-\")","v":"-"},null,null,null,null,null,null,null,null,null,null,null,null,null,null,null,null,null,null,null,null,null,null,null,"Na",22.989769280000001,22.98976966,22.98976966,"Na K",1,"+Na","+2Na","+K",{"$f":"AM3-AM2","v":21.981944628099999},{"$f":"AS3*2","v":43.963889256199998},{"$f":"AM4-AM2","v":37.955881868100001},"H->Na,K"]
[null,null,null,null,{"$f":"IF($G$4=\"MW↓\",\"U\",IF($G$4=\"MW↑\",\"R\",\"A\"))","v":"U"},null,"MW↓","Additional mass series :","yW_2",null,{"$f":"VLOOKUP(I4,AN3:AO22,2,FALSE)","v":20},null,null,null,null,"mono",null,{"$f":"$L$3&\"H\"","v":"-H"},null,null,null,null,null,{"$f":"OFFSET($AO$2,$K$4,1)","v":"imG-14(yW-187)"},{"$f":"OFFSET($AO$2,$K$4,4)","v":-187.08445791129998},null,null,{"$f":"OFFSET($AO$2,$K$4,2)","v":"m1G(yW-211)"},{"$f":"OFFSET($AO$2,$K$4,5)","v":-211.08445791129998},null,null,{"$f":"OFFSET($AO$2,$K$4,3)","v":"OHyW (yW+16)"},{"$f":"OFFSET($AO$2,$K$4,6)","v":15.9949146223},null,null,"K",39.098300000000002,38.963706899999998,38.963706899999998,"Cyanoethyl",2,"+CE","+2CE","+3CE",{"$f":"AM5","v":53.026549103100002},{"$f":"AM5*2","v":106.0530982062},{"$f":"AM5*3","v":159.07964730930001}]
[null,null,"No.","No.","列","position","position","fragment","ave","ave>p","mono","mono>p","top","top>p",null,{"$f":"IF(P4=\"ave\",0,IF(P4=\"ave>p\",1,IF(P4=\"mono\",2,IF(P4=\"mono>p\",3,IF(P4=\"top\",4,5)))))","v":2},null,{"$f":"$K$3*$J$3","v":-1},{"$f":"$K$3*($J$3+1)","v":-2},{"$f":"$K$3*($J$3+2)","v":-3},{"$f":"$K$3*($J$3+3)","v":-4},{"$f":"$K$3*($J$3+4)","v":-5},null,{"$f":"$K$3*$J$3","v":-1},{"$f":"$K$3*($J$3+1)","v":-2},{"$f":"$K$3*($J$3+2)","v":-3},null,{"$f":"$K$3*$J$3","v":-1},{"$f":"$K$3*($J$3+1)","v":-2},{"$f":"$K$3*($J$3+2)","v":-3},null,{"$f":"$K$3*$J$3","v":-1},{"$f":"$K$3*($J$3+1)","v":-2},{"$f":"$K$3*($J$3+2)","v":-3},"修飾数","CE",53.062620000000003,53.026549103100002,53.026549103100002,"Methyl",3,"+Me","+2Me","+3Me",{"$f":"AM6","v":14.015650063799999},{"$f":"AM6*2","v":28.031300127599998},{"$f":"AM6*3","v":42.046950191400001}]
[{"$f":"RIGHT(CELL(\"filename\",A1),LEN(CELL(\"filename\",A1))-FIND(\"]\",CELL(\"filename\",A1)))","v":"1r"},null,{"$f":"IF(ISNUMBER(E6),1,\"\")","v":1},1,{"$f":"IF(ISNUMBER(MATCH(D6,INDIRECT($A$7&\"!\"&$E$4&\"$7:\"&$E$4&\"$651\"),0)),MATCH(D6,INDIRECT($A$7&\"!\"&$E$4&\"$7:\"&$E$4&\"$651\"),0),\"\")","v":2},{"$f":"IF(ISNUMBER($E6),INDEX(INDIRECT($A$7&\"!h$7:h$651\"),$E6,1),\"\")","v":3},{"$f":"IF(ISNUMBER($E6),$F6&\" : \"&INDEX(INDIRECT($A$7&\"!i$7:i$651\"),$E6,1),\"\")","v":"3 : 11"},{"$f":"IF(ISNUMBER($E6),INDEX(INDIRECT($A$7&\"!DC$7:DC$651\"),$E6,1),\"\")","v":"CCUQUC/CGp"},{"$f":"IF(ISNUMBER($E6),INDEX(INDIRECT($A$7&\"!k$7:k$651\"),$E6,1),\"\")","v":3010.8685580000001},{"$f":"IF(ISNUMBER($E6),INDEX(INDIRECT($A$7&\"!l$7:l$651\"),$E6,1),\"\")","v":2992.853278},{"$f":"IF(ISNUMBER($E6),INDEX(INDIRECT($A$7&\"!m$7:m$651\"),$E6,1),\"\")","v":3009.4574311614997},{"$f":"IF(ISNUMBER($E6),INDEX(INDIRECT($A$7&\"!n$7:n$651\"),$E6,1),\"\")","v":2991.4468664753995},{"$f":"IF(ISNUMBER($E6),INDEX(INDIRECT($A$7&\"!o$7:o$651\"),$E6,1),\"\")","v":3010.4574311614997},{"$f":"IF(ISNUMBER($E6),INDEX(INDIRECT($A$7&\"!p$7:p$651\"),$E6,1),\"\")","v":2992.4468664753995},null,{"$f":"OFFSET(I6,0,P$5)","v":3009.4574311614997},null,{"$f":"IF(ISNUMBER($P6),($P6+R$5*$AM$2)/ABS(R$5),\"\")","v":3008.4496061295995},1503.7208905488499,1002.1446520219332,751.35653275847494,600.88366120039996,null,{"$f":"IF(ISNUMBER($P6),($P6+X$5*$AM$2+$Y$4)/ABS(X$5),\"\")","v":2821.3651482182995},1410.1786615931999,939.78316605149985,null,{"$f":"IF(ISNUMBER($P6),($P6+AB$5*$AM$2+$AC$4)/ABS(AB$5),\"\")","v":2797.3651482182995},1398.1786615931999,931.78316605149985,null,{"$f":"IF(ISNUMBER($P6),($P6+AF$5*$AM$2+$AG$4)/ABS(AF$5),\"\")","v":3024.4445207518993},1511.7183478599998,1007.4762902293664,{"$f":"IF(ISNUMBER($E6),INDEX(INDIRECT($A$7&\"!CZ$7:CZ$651\"),$E6,1),\"\")","v":2},"Me",14.026579999999999,14.015650063799999,14.015650063799999,"O/S/H2O",4,"+O","+S-O","-H2O",{"$f":"AM7","v":15.9949146223},{"$f":"AM8-AM7","v":15.977156107699999},{"$f":"-AM2*2-AM7","v":-18.0105646861}]
[{"$f":"LEFT(A6,LEN(A6)-1)","v":"1"},null,{"$f":"IF(ISNUMBER(E7),C6+1,\"\")","v":2},2,1,{"$f":"IF(ISNUMBER($E7),INDEX(INDIRECT($A$7&\"!h$7:h$651\"),$E7,1),\"\")","v":1},"1 : 2",{"$f":"IF(ISNUMBER($E7),INDEX(INDIRECT($A$7&\"!DC$7:DC$651\"),$E7,1),\"\")","v":"pUGp"},749.36652600000002,731.35124600000006,749.04963117490001,731.03906648880002,749.04963117490001,731.03906648880002,null,749.04963117490001,null,748.04180614300003,373.51699055555002,248.67538535973335,186.25458276182499,148.80210120307999,null,560.95734823170005,279.97476159990003,186.31389938930002,null,536.95734823170005,267.97476159990003,178.31389938930002,null,764.03672076530006,381.51444786670004,254.0070235671667,{"$f":"IF(ISNUMBER($E7),INDEX(INDIRECT($A$7&\"!CZ$7:CZ$651\"),$E7,1),\"\")","v":0},"O",15.9994,15.9949146223,15.9949146223,"Se-S/Se-O/+phosphate",5,"+Se-S","+Se-O","+p",{"$f":"AM9-AM8","v":47.944451369999996},{"$f":"AM9-AM7","v":63.921607477699993},{"$f":"AM10","v":79.966330388800003}]
[1,"塩基以上",3,3,3,12,"12 : 13","CA",572.42256200000008,"",572.13804019199995,"",572.13804019199995,"",null,572.13804019199995,null,571.13021516009997,285.06119506409999,189.7048550321,142.02668501609998,113.41978300649998,null,384.04575724879999,191.51896610845,127.34336906166668,null,360.04575724879999,179.51896610845,119.34336906166668,null,587.12512978239999,293.05865237525001,195.03649323953334,0,"S",32.064999999999998,31.972070729999999,31.972070729999999,"Acetyl",6,"+Ac","+2Ac","+3Ac",{"$f":"AM11","v":42.010559999999998},{"$f":"AM11*2","v":84.021119999999996},{"$f":"AM11*3","v":126.03167999999999}]
["T->U","変換しない","",4,"","","","","","","","","","",null,"",null,"","","","","",null,"","","",null,"","","",null,"","","","","Se(80)",78.959999999999994,79.916522099999995,79.916522099999995,"Geranylation",7,"+geranyl","+ge-H2O","+CH2COOH",{"$f":"AM12","v":136.12519},{"$f":"AM12-AM7-AM2*2","v":118.11462531390001},{"$f":"AM13","v":58.005479999999999}]
[null,{"$f":"IF(B9=\"変換する\",\"U\",\"T\")","v":"T"},"",5,"","","","","","","","","","",null,"",null,"","","","","",null,"","","",null,"","","",null,"","","","","p",79.979901999999996,79.966330388800003,79.966330388800003,"H2/H2-Me/-Me",8,"+H2","+H2-Me","-Me",{"$f":"AM2*2","v":2.0156500637999999},{"$f":"AM2*2-AM6","v":-12},{"$f":"-AM6","v":-14.015650063799999}]
["ユーザー定義(custom base)",null,"",6,"","","","","","","","","","",null,"",null,"","","","","",null,"","","",null,"","","",null,"","","","","Ac",42.036679999999997,42.010559999999998,42.010559999999998,"S/ms/ms-H2O",9,"+S","+ms","+ms-H2O",{"$f":"AM8","v":31.972070729999999},{"$f":"AM8+AM6","v":45.987720793799994},{"$f":"AM8+AM6-AM2*2-AM7","v":27.97715610769999}]
["N",273.24259999999998,"",7,"","","","","","","","","","",null,"",null,"","","","","",null,"","","",null,"","","",null,"","","","","Ge",136.23403999999999,136.12519,{"$f":"IF(OR($P$4=\"ave\",$P$4=\"ave>p\"),AK12,AL12)","v":136.12519},"cm/ncm/mcm",10,"+cm","+ncm","+mcm",{"$f":"AM13","v":58.005479999999999},{"$f":"AM13-AM7+AM14+AM2","v":57.021464416999997},{"$f":"AM13+AM6","v":72.021130063800001}]
["mono→",273.09608523449998,"",8,"","","","","","","","","","",null,"",null,"","","","","",null,"","","",null,"","","",null,"","","","","CarboxyMethyl",58.036079999999998,58.005479999999999,{"$f":"IF(OR($P$4=\"ave\",$P$4=\"ave>p\"),AK13,AL13)","v":58.005479999999999},"chm/nchm/mchm",11,"+chm","+nchm","+mchm",{"$f":"AS12+$AM7","v":74.000394622299993},{"$f":"AT12+$AM7","v":73.016379039299991},{"$f":"AU12+$AM7","v":88.016044686100003}]
["[M}0",null,"",9,"","","","","","","","","","",null,"",null,"","","","","",null,"","","",null,"","","",null,"","","","","N",14.0067,14.0030740074,{"$f":"IF(OR($P$4=\"ave\",$P$4=\"ave>p\"),AK14,AL14)","v":14.0030740074},"-O/-S/deamination",12,"-O","-S","-NH+O",{"$f":"-AM7","v":-15.9949146223},{"$f":"-AM8","v":-31.972070729999999},{"$f":"AM7-AM14-AM2","v":0.98401558299999925}]
[null,"ladder (nt)","",10,"","","","","","","","","","",null,"",null,"","","","","",null,"","","",null,"","","",null,"","","","","G base",151.12629999999999,151.04940999999999,{"$f":"IF(OR($P$4=\"ave\",$P$4=\"ave>p\"),AK15,AL15)","v":151.04940999999999},"+H2O/-m7G/-m7G+H2O",13,"+H2O","-m7G","-m7G+H2O",{"$f":"AM2*2+AM7","v":18.0105646861},{"$f":"-AM15-AM6","v":-165.06506006379999},{"$f":"AM2*2+AM7-AM15-AM6","v":-147.05449537769999}]
{"$rows_left_out":636}
{"sheet":"1","index":1,"n_rows":651,"n_cols":116,"rows_kept":651,"cut":false,"hidden":false,"merged":[]}
[{"$f":"RIGHT(CELL(\"filename\",A1),LEN(CELL(\"filename\",A1))-FIND(\"]\",CELL(\"filename\",A1)))&\"r\"","v":"1r"},"5'","3'","TA","処理",null,null,null,{"$f":"INDIRECT(A1&\"!G1\")","v":">test"}]
[null,{"$f":"INDIRECT(A1&\"!B1\")","v":"p-"},{"$f":"INDIRECT(A1&\"!B2\")","v":"-OH"},{"$f":"INDIRECT(A1&\"!B19\")","v":"-OH"},null,null,null,null,{"$f":"SUBSTITUTE(UPPER(SUBSTITUTE(INDIRECT(A1&\"!G2\"),\" \",\"\")),\"T\",INDIRECT(A1&\"!B10\"))","v":"UGCCUQUC/CGCA"},null,{"$f":"SUBSTITUTE(UPPER(SUBSTITUTE(INDIRECT(A1&\"!I2\"),\" \",\"\")),\"T\",INDIRECT(A1&\"!B10\"))","v":""}]
[null,{"$f":"INDIRECT(A1&\"!B42\")","v":"p-"},{"$f":"IF(C2=\"-p\",0,-1)","v":-1},{"$f":"IF(D2=\"-p\",0,-1)","v":-1},null,null,null,null,{"$f":"LEN($I$2)","v":13},null,null,null,null,null,null,null,null,null,null,null,null,null,null,null,null,null,null,null,null,null,null,null,null,null,null,null,null,null,null,null,null,null,null,null,null,null,null,null,null,null,null,null,null,null,null,null,null,null,null,null,null,null,null,null,null,null,null,null,null,null,null,null,null,null,null,null,null,null,null,"ユーザー用塩基",null,null,null,null,null,null,null,null,null,null,null,null,null,null,null,null,null,null,null,"HPO3"]
[null,null,null,null,null,null,"1=末端、2=3'ラダー",null,null,null,null,null,null,null,"topの適当な予想値",null,null,"小さい順","小さい順重複","同点","大きい順","長さ","C","U","T","A","G","^",":","#","°","~",")","\\","J","B","=","/","\"","+","*","`","'",",","|","{","[","]",">","?","%","$","!",1,2,3,4,5,6,7,8,9,"D","E","F","I","K","L","M","O","P","Q","R","S","V","W","X","Y","Z","N","}","&","@","H","(","À","Á","Â","Ã","Ä","Å","Æ","∝","Ç","◊","Ò","Õ","Ï","Ñ","-p",">p","H2O","CH2","修飾の数","5'","3'","fragment","cap m7G","5'末端","p","Me","m7G","H2O",null,"ave","mono"]
[null,"p個数",null,null,null,"1=Rnase",null,"position","position","fragment","ave","ave>p","mono","mono>p","top","top>p",null,null,null,null,null,null,243.21662000000003,244.20138,258.22796,267.24131999999997,283.24072000000001,479.33584200000007,281.2679,297.26730000000003,285.25330000000002,315.27927999999997,345.30525999999998,272.25454000000002,258.22796,257.2432,281.2679,281.2679,281.2679,335.35834,381.44991999999996,351.35774000000004,257.2432,332.26343999999995,325.32045999999997,287.26918000000001,458.44628,258.22796,271.22672,257.2432,259.28222000000005,347.34427999999997,331.27868000000001,316.26403999999997,260.26697999999999,332.32963999999998,260.26697999999999,274.22735999999998,412.35470000000004,297.26730000000003,571.53441999999995,571.53441999999995,246.21725999999998,426.38128,274.29356000000001,268.22608000000002,297.26730000000003,297.26730000000003,285.25330000000002,282.25266000000005,244.20138,409.39382000000001,311.29388,303.33478000000002,318.23685999999998,540.48062000000004,345.30525999999998,508.48181999999997,258.22796,{"$f":"INDIRECT(A1&\"!B12\")","v":273.24259999999998},371.38890000000004,301.2527,381.35895999999997,397.42455999999999,324.29264000000001,335.31528000000003,349.34186000000005,295.29448000000002,359.33184,273.24259999999998,287.26918000000001,341.36292000000003,260.20078000000001,192.16988000000001,302.23746,271.26978000000003,258.22796,394.33942000000002,287.22612000000004,79.979901999999996,61.964621999999991,18.015280000000001,14.026579999999999,null,null,null,null,null,"-OH",0,0,0,0]
[null,"5-p","3-p","H2O","CH2","5end","3end",0,null,null,null,null,null,null,null,null,null,{"$f":"MAX(R7:R500)","v":3},null,null,null,null,243.08552054839998,244.06953613140001,258.08518619519998,267.09675394089999,283.09166856320002,479.10534307410001,281.11240400470001,297.10731862699998,285.09608523449998,315.10664992059998,345.11721460669997,272.100836259,258.08518619519998,257.10117061220001,281.11240400470001,281.11240400470001,281.11240400470001,335.15935419610003,381.14707498989998,351.1542688184,257.10117061220001,332.08558012589998,325.13861875459997,287.1117352983,458.12198245460002,258.08518619519998,271.08043517070001,257.10117061220001,259.0626766561,347.07872065059996,331.10156454290001,316.09066550360001,260.04669223909997,332.06782161129996,260.04669223909997,274.08010081750001,412.13426166080001,297.10731862699998,571.21257155730007,571.21257155730007,246.08518619519998,426.14991172460003,274.06234230289999,268.08076952390002,297.10731862699998,297.10731862699998,285.09608523449998,282.09641958769998,244.06953613140001,409.15974812679997,311.12296869080001,303.08889140599996,318.06993006209996,540.18160578289996,345.11721460669997,508.19177653829996,258.08518619519998,{"$f":"INDIRECT(A1&\"!B13\")","v":273.09608523449998},371.18048356829996,301.09099985680001,381.08419995899993,397.0613560667,324.11821766629998,335.12296869080001,349.13861875459997,295.12805406849998,359.1328646705,273.09608523449998,287.1117352983,341.16991888219997,260.06445075369999,192.07462150909998,302.07501543979998,271.11682067599997,258.08518619519998,394.12369697469995,287.07534979299999,79.966330388800003,61.955765702700006,18.0105646861,14.015650063799999,null,null,null,null,null,"p-",1,0,0,0,"HPO3",79.979901999999996,79.966330388800003]
[{"$f":"IF(V7=0,\"\",A6+1)","v":1},{"$f":"IF($F7=1,VLOOKUP($B$2,$DE$5:$DG$11,2,FALSE),IF($F7=2,VLOOKUP($B$3,$DE$5:$DG$6,2,FALSE),0))","v":1},{"$f":"IF($C$2=\"forced-OH\",-1,IF($G7=1,$C$3,IF($G7=2,$D$3,0)))","v":0},{"$f":"IF($F7=1,VLOOKUP($B$2,$DE$5:$DI$11,5,FALSE),0)","v":0},{"$f":"IF($F7=1,VLOOKUP($B$2,$DE$5:$DG$11,3,FALSE),0)","v":0},1,null,1,2,"UG",{"$f":"IF(V7=0,\"\",SUMPRODUCT(W$5:CY$5,W7:CY7))","v":749.36652600000002},{"$f":"IF(C7=-1,\"\",K7-18.01528)","v":731.35124600000006},{"$f":"IF(V7=0,\"\",SUMPRODUCT(W$6:CY$6,W7:CY7))","v":749.04963117490001},{"$f":"IF(C7=-1,\"\",M7-18.0105646861)","v":731.03906648880002},{"$f":"IF(V7=0,\"\",M7+TRUNC(K7-M7-0.1))","v":749.04963117490001},{"$f":"IF(C7=-1,\"\",O7-18.0105646861)","v":731.03906648880002},{"$f":"IF(V7>0,ROUND(K7,4),\"\")","v":749.36649999999997},{"$f":"IF(V7>0,S7+T7,\"\")","v":2},{"$f":"IF(V7>0,COUNTIF(Q$7:Q$651,\"<\"&Q7)+1,\"\")","v":2},{"$f":"IF(V7>0,COUNTIF(Q$7:Q7,\"=\"&Q7)-1,\"\")","v":0},{"$f":"IF(V7>0,$R$6-R7+1,\"\")","v":2},{"$f":"LEN(J7)","v":2},{"$f":"$V7-LEN(SUBSTITUTE($J7,W$4,\"\"))","v":0},1,0,0,1,{"$f":"IF($CZ7>0,$V7-LEN(SUBSTITUTE($J7,AB$4,\"\")),0)","v":0},0,0,0,0,0,0,0,0,0,{"$f":"IF($CZ7>0,$V7-LEN(SUBSTITUTE($J7,AL$4,\"\")),0)","v":0},0,0,0,0,0,0,0,0,0,{"$f":"IF($CZ7>0,$V7-LEN(SUBSTITUTE($J7,AV$4,\"\")),0)","v":0},0,0,0,0,0,0,0,0,0,0,0,{"$f":"IF($CZ7>0,$V7-LEN(SUBSTITUTE($J7,BH$4,\"\")),0)+DD7","v":0},{"$f":"IF($CZ7>0,$V7-LEN(SUBSTITUTE($J7,BI$4,\"\")),0)","v":0},0,0,0,0,0,0,0,0,0,{"$f":"IF($CZ7>0,$V7-LEN(SUBSTITUTE($J7,BS$4,\"\")),0)","v":0},0,0,0,0,0,0,0,0,0,{"$f":"IF($CZ7>0,$V7-LEN(SUBSTITUTE($J7,CC$4,\"\")),0)","v":0},0,0,0,0,0,0,0,0,0,0,{"$f":"IF($CZ7>0,$V7-LEN(SUBSTITUTE($J7,CN$4,\"\")),0)","v":0},0,0,0,{"$f":"IF($CZ7>0,$V7-LEN(SUBSTITUTE($J7,CR$4,\"\")),0)","v":0},0,0,0,{"$f":"V7+B7+C7","v":3},null,{"$f":"-(V7-1)+D7","v":-1},{"$f":"E7","v":0},{"$f":"$V7-$W7-$X7-$Z7-$AA7","v":0},{"$f":"IF($B7=0,\"\",IF(F7=1,LEFT($B$2,LEN($B$2)-1),LEFT($B$3,LEN($B$3)-1)))","v":"p"},{"$f":"IF($C7=0,\"p\",\"\")","v":"p"},{"$f":"DA7&J7&DB7","v":"pUGp"},{"$f":"IF($F7=1,VLOOKUP($B$2,$DE$5:$DH$11,4,FALSE),0)","v":0},"pp-",2,0,0,0,"H2P2O6"]
[2,{"$f":"IF($F8=1,VLOOKUP($B$2,$DE$5:$DG$11,2,FALSE),IF($F8=2,VLOOKUP($B$3,$DE$5:$DG$6,2,FALSE),0))","v":0},0,0,0,null,null,3,11,"CCUQUC/CG",3010.8685580000001,2992.853278,3009.4574311614997,2991.4468664753995,3010.4574311614997,2992.4468664753995,3010.8685999999998,3,3,{"$f":"IF(V8>0,COUNTIF(Q$7:Q8,\"=\"&Q8)-1,\"\")","v":0},1,9,4,2,0,0,1,0,0,0,0,0,0,0,0,0,0,1,0,0,0,0,0,0,0,0,0,0,0,0,0,0,0,0,0,0,0,0,0,0,0,0,0,0,0,0,0,0,0,0,0,1,0,0,0,0,0,0,0,0,0,0,0,0,0,0,0,0,0,0,0,0,0,0,0,0,0,0,0,9,null,-8,0,2,{"$f":"IF($B8=0,\"\",IF(F8=1,LEFT($B$2,LEN($B$2)-1),LEFT($B$3,LEN($B$3)-1)))","v":""},"p","CCUQUC/CGp",{"$f":"IF($F8=1,VLOOKUP($B$2,$DE$5:$DH$11,4,FALSE),0)","v":0},"ppp-",3,0,0,0,"H3P3O9",239.939706,239.89899116640001]
[3,0,-1,{"$f":"IF($F9=1,VLOOKUP($B$2,$DE$5:$DI$11,5,FALSE),0)","v":0},0,null,1,12,13,"CA",572.42256200000008,"",572.13804019199995,"",572.13804019199995,"",572.42259999999999,1,1,{"$f":"IF(V9>0,COUNTIF(Q$7:Q9,\"=\"&Q9)-1,\"\")","v":0},3,2,1,0,0,1,0,0,0,0,0,0,0,0,0,0,0,0,0,0,0,0,0,0,0,0,0,0,0,0,0,0,0,0,0,0,0,0,0,0,0,0,0,0,0,0,0,0,0,0,0,0,0,0,0,0,0,0,0,0,0,0,0,0,0,0,0,0,0,0,0,0,0,0,0,0,0,0,0,1,null,-1,0,0,"","","CA",0,"m-ppp-",3,1,0,0,"CH2+H3P3O9",253.966286,253.9146412302]
["",0,0,0,0,null,null,null,null,null,"",{"$error":"#VALUE!"},"",{"$error":"#VALUE!"},"",{"$error":"#VALUE!"},"","","",{"$f":"IF(V10>0,COUNTIF(Q$7:Q10,\"=\"&Q10)-1,\"\")","v":""},"",0,0,0,0,0,0,0,0,0,0,0,0,0,0,0,0,0,0,0,0,0,0,0,0,0,0,0,0,0,0,0,0,0,0,0,0,0,0,0,0,0,0,0,0,0,0,0,0,0,0,0,0,0,0,0,0,0,0,0,0,0,0,0,0,0,0,0,0,0,0,0,0,0,0,0,0,0,0,0,null,1,0,0,"","p","p",0,"m(3)Gppp-",3,2,1,-1,"m7G+H3P3O9-H2O+(CH2)*2",547.24488600000018,547.02704523490002]
["",0,0,0,0,null,null,null,null,null,"",{"$error":"#VALUE!"},"",{"$error":"#VALUE!"},"",{"$error":"#VALUE!"},"","","",{"$f":"IF(V11>0,COUNTIF(Q$7:Q11,\"=\"&Q11)-1,\"\")","v":""},"",0,0,0,0,0,0,0,0,0,0,0,0,0,0,0,0,0,0,0,0,0,0,0,0,0,0,0,0,0,0,0,0,0,0,0,0,0,0,0,0,0,0,0,0,0,0,0,0,0,0,0,0,0,0,0,0,0,0,0,0,0,0,0,0,0,0,0,0,0,0,0,0,0,0,0,0,0,0,0,null,1,0,0,"","p","p",0,"m(1)Gppp-",3,0,1,-1,"m7G+H3P3O9-H2O",519.19172600000013,518.99574510729997]
["",0,0,0,0,null,null,null,null,null,"",{"$error":"#VALUE!"},"",{"$error":"#VALUE!"},"",{"$error":"#VALUE!"},"","","",{"$f":"IF(V12>0,COUNTIF(Q$7:Q12,\"=\"&Q12)-1,\"\")","v":""},"",0,0,0,0,0,0,0,0,0,0,0,0,0,0,0,0,0,0,0,0,0,0,0,0,0,0,0,0,0,0,0,0,0,0,0,0,0,0,0,0,0,0,{"$f":"IF($CZ12>0,$V12-LEN(SUBSTITUTE($J12,BL$4,\"\")),0)","v":0},0,0,0,0,0,0,0,0,0,0,0,0,0,0,0,0,0,0,0,0,0,0,0,0,0,0,0,0,0,0,0,0,0,0,0,0,null,1,0,0,"","p","p",0]
["",0,0,0,0,null,null,null,null,null,"",{"$error":"#VALUE!"},"",{"$error":"#VALUE!"},"",{"$error":"#VALUE!"},"","","",{"$f":"IF(V13>0,COUNTIF(Q$7:Q13,\"=\"&Q13)-1,\"\")","v":""},"",0,0,0,0,0,0,0,0,0,0,0,0,0,0,0,0,0,0,0,0,0,0,0,0,0,0,0,0,0,0,0,0,0,0,0,0,0,0,0,0,0,0,0,0,0,0,0,0,0,0,0,0,0,0,0,0,0,0,0,0,0,0,0,0,0,0,0,0,0,0,0,0,0,0,0,0,0,0,0,null,1,0,0,"","p","p",0]
["",0,0,0,0,null,null,null,null,null,"",{"$error":"#VALUE!"},"",{"$error":"#VALUE!"},"",{"$error":"#VALUE!"},"","","",{"$f":"IF(V14>0,COUNTIF(Q$7:Q14,\"=\"&Q14)-1,\"\")","v":""},"",0,0,0,0,0,0,0,0,0,0,0,0,0,0,0,0,0,0,0,0,0,0,0,0,0,0,0,0,0,0,0,0,0,0,0,0,0,0,0,0,0,0,0,0,0,0,0,0,0,0,0,0,0,0,0,0,0,0,0,0,0,0,0,0,0,0,0,0,0,0,0,0,0,0,0,0,0,0,0,null,1,0,0,"","p","p",0]
["",0,0,0,0,null,null,null,null,null,"",{"$error":"#VALUE!"},"",{"$error":"#VALUE!"},"",{"$error":"#VALUE!"},"","","",{"$f":"IF(V15>0,COUNTIF(Q$7:Q15,\"=\"&Q15)-1,\"\")","v":""},"",0,0,0,0,0,0,0,0,0,0,0,0,0,0,0,0,0,0,0,0,0,0,0,0,0,0,0,0,0,0,0,0,0,0,0,0,0,0,0,0,0,0,0,0,0,0,0,0,0,0,0,0,0,0,0,0,0,0,0,0,0,0,0,0,0,0,0,0,0,0,0,0,0,0,0,0,0,0,0,null,1,0,0,"","p","p",0]
{"$rows_left_out":637}
{"sheet":"Nucleoside table","index":2,"n_rows":79,"n_cols":9,"rows_kept":79,"cut":false,"hidden":false,"merged":[]}
[null,null,"common name","1-letter name"]
[null,null,"慣用表記","1文字","average","mono isotopic","別名"]
[null,null,"C","C",243.21662000000003,243.08552054839998,null,"N","ユーザー定義"]
[null,null,"U","U",244.20138,244.06953613140001]
[null,null,"T","T",258.22796,258.08518619519998]
[null,null,"A","A",267.24131999999997,267.09675394089999]
[null,null,"G","G",283.24072000000001,283.09166856320002]
[null,null,"Ar(p)","^",479.33584200000007,479.10534307410001,null,"特殊文字"]
[null,null,"Am",":",281.2679,281.11240400470001,null,"~, ?, *を検索するときは~でエスケープしたクエリを投げる必要がある。"]
[null,null,"Gm","#",297.26730000000003,297.10731862699998]
[null,null,"f5Cm","°",285.25330000000002,285.09608523449998,null,"１文字表記の拡張"]
[null,null,"ncm5Um","~",315.27927999999997,315.10664992059998,null,"独自拡張した部分は、適当に決めたものであって、外では通用しないので注意。"]
[null,null,"cmnm5Um",")",345.30525999999998,345.11721460669997,null,"（そもそも１文字表記自体、RNAのデータベース関係の人以外には通用しません。）"]
[null,null,"m5Um","\\",272.25454000000002,272.100836259,null,"ユニコード　ラテン補助の記号つきAから順番に割り当てている。"]
[null,null,"Um","J",258.22796,258.08518619519998,null,"@とHは未同定修飾に割り当てられていたものなので、扱いに注意を要する。"]
{"$rows_left_out":65}
{"sheet":"tables","index":3,"n_rows":25,"n_cols":14,"rows_kept":25,"cut":false,"hidden":false,"merged":[]}
[null,null,null,null,null,"http://www.riken.jp/BiomolChar/Aminoacidmolecularmasses_J.html"]
[null,null,"アミノ酸残基精密質量表 (アミノ酸-H2O)",null,null,null,"水を引いてある"]
[null,null,"アミノ酸残基","略号","一文字表記","組成式","平均質量(u)","単同位体精密質量（u","MW calculator",null,null,"チオウリジンのバリエーション",null,"monoisotoic mass (z=0)"]
[null,null,"グリシン","Gly","G","C2H3NO",57.051000000000002,57.02146372,57.021462800000002,null,null,"チオ","sU",260.04669223909997]
[null,null,"アラニン","Ala","A","C3H5NO",71.078000000000003,71.037113779999999,71.037111999999993,null,null,"ウリジン","U",244.06953613140001]
[null,null,"セリン","Ser","S","C3H5NO2",87.076999999999998,87.032028400000002,null,null,null,"酸化的脱硫黄化","h2U (-O)",228.07462150909998]
[null,null,"プロリン","Pro","P","C5H7NO",97.114999999999995,97.052763850000005,null,null,null,"<酸化の中間体>"]
[null,null,"バリン","Val","V","C5H9NO",99.131,99.068413910000004,null,null,null,"スルフェン酸 / S-oxide","+O",276.0416068614]
[null,null,"トレオニン","Thr","T","C4H7NO2",101.104,101.04767846999999,null,null,null,null,"+H2O",278.05725692519997]
[null,null,"システイン","Cys","C","C3H5NOS",103.143,103.00918478,null,null,null,null,"+H2O2",294.0521715475]
[null,null,"イソロイシン","Ile","I","C6H11NO",113.158,113.08406398,null,null,null,"スルフィン酸","+2O",292.03652148369997]
[null,null,"ロイシン","Leu","L","C6H11NO",113.158,113.08406398,null,null,null,"スルホン酸","+3O",308.031436106]
[null,null,"アスパラギン","Asn","N","C4H6N2O2",114.10299999999999,114.04292744]
[null,null,"アスパラギン酸","Asp","D","C4H5NO3",115.087,115.02694302]
[null,null,"グルタミン","Gln","Q","C5H8N2O2",128.12899999999999,128.05857750999999]
{"$rows_left_out":10}