{"text_format":"1","workbook":"xlsx","n_sheets":4,"sheets":["1r","1","Nucleoside table","tables"],"not_rendered":{"charts":0,"images":0,"macros":1,"external_links":0,"defined_names":1,"comments":1,"pivot_tables":0},"unopened":[],"bounds":{"document_bytes":16777216,"sheet_cells":100000,"rows_first":2000,"rows_last":500,"rows_between":2000,"halvings":0,"cell_chars":16384,"cell_head_chars":4096},"cells_cut":0,"cells_raw":0,"read":"whole","date_system":"1900"}

{"sheet":"1r","index":0,"n_rows":650,"n_cols":48,"rows_kept":650,"cut":false,"hidden":false,"merged":[[3,8,3,9],[38,0,38,1]]}
["5'","p-",null,null,null,null,">test",null,"↓second sequence",null,null,null,null,null,null,null,null,null,null,null,null,null,null,null,null,null,null,null,null,null,null,null,null,null,null,null,"ave","mono","selected"]
["3'","-OH",null,null,null,null,"UGCCUQUC/CGCA",null,null,null,null,null,null,null,null,null,null,null,null,null,null,null,null,null,null,null,null,null,null,null,null,null,null,null,null,"H",1.0079400000000001,1.0078250318999999,{"$f":"IF(OR($P$4=\"ave\",$P$4=\"ave>p\"),AK2,AL2)","v":1.0078250318999999},null,null,null,2,3,"+1","+2","+3"]
["Cut at","G,L,I",null,null,null,null,null,null,"Negative",1,{"$f":"IF(I3=\"Positive\",1,-1)","v":-1},{"$f":"IF(I3=\"Positive\",\"+\",\"-\")","v":"-"},null,null,null,null,null,null,null,null,null,null,null,null,null,null,null,null,null,null,null,null,null,null,null,"Na",22.989769280000001,22.98976966,22.98976966,"Na K",1,"+Na","+2Na","+K",{"$f":"AM3-AM2","v":21.981944628099999},{"$f":"AS3*2","v":43.963889256199998},{"$f":"AM4-AM2","v":37.955881868100001},"H->Na,K"]
[null,null,null,null,{"$f":"IF($G$4=\"MW↓\",\"U\",IF($G$4=\"MW↑\",\"R\",\"A\"))","v":"U"},null,"MW↓","Additional mass series :","yW_2",null,{"$f":"VLOOKUP(I4,AN3:AO22,2,FALSE)","v":20},null,null,null,null,"mono",null,{"$f":"$L$3&\"H\"","v":"-H"},null,null,null,null,null,{"$f":"OFFSET($AO$2,$K$4,1)","v":"imG-14(yW-187)"},{"$f":"OFFSET($AO$2,$K$4,4)","v":-187.08445791129998},null,null,{"$f":"OFFSET($AO$2,$K$4,2)","v":"m1G(yW-211)"},{"$f":"OFFSET($AO$2,$K$4,5)","v":-211.08445791129998},null,null,{"$f":"OFFSET($AO$2,$K$4,3)","v":"OHyW (yW+16)"},{"$f":"OFFSET($AO$2,$K$4,6)","v":15.9949146223},null,null,"K",39.098300000000002,38.963706899999998,38.963706899999998,"Cyanoethyl",2,"+CE","+2CE","+3CE",{"$f":"AM5","v":53.026549103100002},{"$f":"AM5*2","v":106.0530982062},{"$f":"AM5*3","v":159.07964730930001}]
[null,null,"No.","No.","列","position","position","fragment","ave","ave>p","mono","mono>p","top","top>p",null,{"$f":"IF(P4=\"ave\",0,IF(P4=\"ave>p\",1,IF(P4=\"mono\",2,IF(P4=\"mono>p\",3,IF(P4=\"top\",4,5)))))","v":2},null,{"$f":"$K$3*$J$3","v":-1},{"$f":"$K$3*($J$3+1)","v":-2},{"$f":"$K$3*($J$3+2)","v":-3},{"$f":"$K$3*($J$3+3)","v":-4},{"$f":"$K$3*($J$3+4)","v":-5},null,{"$f":"$K$3*$J$3","v":-1},{"$f":"$K$3*($J$3+1)","v":-2},{"$f":"$K$3*($J$3+2)","v":-3},null,{"$f":"$K$3*$J$3","v":-1},{"$f":"$K$3*($J$3+1)","v":-2},{"$f":"$K$3*($J$3+2)","v":-3},null,{"$f":"$K$3*$J$3","v":-1},{"$f":"$K$3*($J$3+1)","v":-2},{"$f":"$K$3*($J$3+2)","v":-3},"修飾数","CE",53.062620000000003,53.026549103100002,53.026549103100002,"Methyl",3,"+Me","+2Me","+3Me",{"$f":"AM6","v":14.015650063799999},{"$f":"AM6*2","v":28.031300127599998},{"$f":"AM6*3","v":42.046950191400001}]
[{"$f":"RIGHT(CELL(\"filename\",A1),LEN(CELL(\"filename\",A1))-FIND(\"]\",CELL(\"filename\",A1)))","v":"1r"},null,{"$f":"IF(ISNUMBER(E6),1,\"\")","v":1},1,{"$f":"IF(ISNUMBER(MATCH(D6,INDIRECT($A$7&\"!\"&$E$4&\"$7:\"&$E$4&\"$651\"),0)),MATCH(D6,INDIRECT($A$7&\"!\"&$E$4&\"$7:\"&$E$4&\"$651\"),0),\"\")","v":2},{"$f":"IF(ISNUMBER($E6),INDEX(INDIRECT($A$7&\"!h$7:h$651\"),$E6,1),\"\")","v":3},{"$f":"IF(ISNUMBER($E6),$F6&\" : \"&INDEX(INDIRECT($A$7&\"!i$7:i$651\"),$E6,1),\"\")","v":"3 : 11"},{"$f":"IF(ISNUMBER($E6),INDEX(INDIRECT($A$7&\"!DC$7:DC$651\"),$E6,1),\"\")","v":"CCUQUC/CGp"},{"$f":"IF(ISNUMBER($E6),INDEX(INDIRECT($A$7&\"!k$7:k$651\"),$E6,1),\"\")","v":3010.8685580000001},{"$f":"IF(ISNUMBER($E6),INDEX(INDIRECT($A$7&\"!l$7:l$651\"),$E6,1),\"\")","v":2992.853278},{"$f":"IF(ISNUMBER($E6),INDEX(INDIRECT($A$7&\"!m$7:m$651\"),$E6,1),\"\")","v":3009.4574311614997},{"$f":"IF(ISNUMBER($E6),INDEX(INDIRECT($A$7&\"!n$7:n$651\"),$E6,1),\"\")","v":2991.4468664753995},{"$f":"IF(ISNUMBER($E6),INDEX(INDIRECT($A$7&\"!o$7:o$651\"),$E6,1),\"\")","v":3010.4574311614997},{"$f":"IF(ISNUMBER($E6),INDEX(INDIRECT($A$7&\"!p$7:p$651\"),$E6,1),\"\")","v":2992.4468664753995},null,{"$f":"OFFSET(I6,0,P$5)","v":3009.4574311614997},null,{"$f":"IF(ISNUMBER($P6),($P6+R$5*$AM$2)/ABS(R$5),\"\")","v":3008.4496061295995},1503.7208905488499,1002.1446520219332,751.35653275847494,600.88366120039996,null,{"$f":"IF(ISNUMBER($P6),($P6+X$5*$AM$2+$Y$4)/ABS(X$5),\"\")","v":2821.3651482182995},1410.1786615931999,939.78316605149985,null,{"$f":"IF(ISNUMBER($P6),($P6+AB$5*$AM$2+$AC$4)/ABS(AB$5),\"\")","v":2797.3651482182995},1398.1786615931999,931.78316605149985,null,{"$f":"IF(ISNUMBER($P6),($P6+AF$5*$AM$2+$AG$4)/ABS(AF$5),\"\")","v":3024.4445207518993},1511.7183478599998,1007.4762902293664,{"$f":"IF(ISNUMBER($E6),INDEX(INDIRECT($A$7&\"!CZ$7:CZ$651\"),$E6,1),\"\")","v":2},"Me",14.026579999999999,14.015650063799999,14.015650063799999,"O/S/H2O",4,"+O","+S-O","-H2O",{"$f":"AM7","v":15.9949146223},{"$f":"AM8-AM7","v":15.977156107699999},{"$f":"-AM2*2-AM7","v":-18.0105646861}]
[{"$f":"LEFT(A6,LEN(A6)-1)","v":"1"},null,{"$f":"IF(ISNUMBER(E7),C6+1,\"\")","v":2},2,1,{"$f":"IF(ISNUMBER($E7),INDEX(INDIRECT($A$7&\"!h$7:h$651\"),$E7,1),\"\")","v":1},"1 : 2",{"$f":"IF(ISNUMBER($E7),INDEX(INDIRECT($A$7&\"!DC$7:DC$651\"),$E7,1),\"\")","v":"pUGp"},749.36652600000002,731.35124600000006,749.04963117490001,731.03906648880002,749.04963117490001,731.03906648880002,null,749.04963117490001,null,748.04180614300003,373.51699055555002,248.67538535973335,186.25458276182499,148.80210120307999,null,560.95734823170005,279.97476159990003,186.31389938930002,null,536.95734823170005,267.97476159990003,178.31389938930002,null,764.03672076530006,381.51444786670004,254.0070235671667,{"$f":"IF(ISNUMBER($E7),INDEX(INDIRECT($A$7&\"!CZ$7:CZ$651\"),$E7,1),\"\")","v":0},"O",15.9994,15.9949146223,15.9949146223,"Se-S/Se-O/+phosphate",5,"+Se-S","+Se-O","+p",{"$f":"AM9-AM8","v":47.944451369999996},{"$f":"AM9-AM7","v":63.921607477699993},{"$f":"AM10","v":79.966330388800003}]
[1,"塩基以上",3,3,3,12,"12 : 13","CA",572.42256200000008,"",572.13804019199995,"",572.13804019199995,"",null,572.13804019199995,null,571.13021516009997,285.06119506409999,189.7048550321,142.02668501609998,113.41978300649998,null,384.04575724879999,191.51896610845,127.34336906166668,null,360.04575724879999,179.51896610845,119.34336906166668,null,587.12512978239999,293.05865237525001,195.03649323953334,0,"S",32.064999999999998,31.972070729999999,31.972070729999999,"Acetyl",6,"+Ac","+2Ac","+3Ac",{"$f":"AM11","v":42.010559999999998},{"$f":"AM11*2","v":84.021119999999996},{"$f":"AM11*3","v":126.03167999999999}]
["T->U","変換しない","",4,"","","","","","","","","","",null,"",null,"","","","","",null,"","","",null,"","","",null,"","","","","Se(80)",78.959999999999994,79.916522099999995,79.916522099999995,"Geranylation",7,"+geranyl","+ge-H2O","+CH2COOH",{"$f":"AM12","v":136.12519},{"$f":"AM12-AM7-AM2*2","v":118.11462531390001},{"$f":"AM13","v":58.005479999999999}]
[null,{"$f":"IF(B9=\"変換する\",\"U\",\"T\")","v":"T"},"",5,"","","","","","","","","","",null,"",null,"","","","","",null,"","","",null,"","","",null,"","","","","p",79.979901999999996,79.966330388800003,79.966330388800003,"H2/H2-Me/-Me",8,"+H2","+H2-Me","-Me",{"$f":"AM2*2","v":2.0156500637999999},{"$f":"AM2*2-AM6","v":-12},{"$f":"-AM6","v":-14.015650063799999}]
["ユーザー定義(custom base)",null,"",6,"","","","","","","","","","",null,"",null,"","","","","",null,"","","",null,"","","",null,"","","","","Ac",42.036679999999997,42.010559999999998,42.010559999999998,"S/ms/ms-H2O",9,"+S","+ms","+ms-H2O",{"$f":"AM8","v":31.972070729999999},{"$f":"AM8+AM6","v":45.987720793799994},{"$f":"AM8+AM6-AM2*2-AM7","v":27.97715610769999}]
["N",273.24259999999998,"",7,"","","","","","","","","","",null,"",null,"","","","","",null,"","","",null,"","","",null,"","","","","Ge",136.23403999999999,136.12519,{"$f":"IF(OR($P$4=\"ave\",$P$4=\"ave>p\"),AK12,AL12)","v":136.12519},"cm/ncm/mcm",10,"+cm","+ncm","+mcm",{"$f":"AM13","v":58.005479999999999},{"$f":"AM13-AM7+AM14+AM2","v":57.021464416999997},{"$f":"AM13+AM6","v":72.021130063800001}]
["mono→",273.09608523449998,"",8,"","","","","","","","","","",null,"",null,"","","","","",null,"","","",null,"","","",null,"","","","","CarboxyMethyl",58.036079999999998,58.005479999999999,{"$f":"IF(OR($P$4=\"ave\",$P$4=\"ave>p\"),AK13,AL13)","v":58.005479999999999},"chm/nchm/mchm",11,"+chm","+nchm","+mchm",{"$f":"AS12+$AM7","v":74.000394622299993},{"$f":"AT12+$AM7","v":73.016379039299991},{"$f":"AU12+$AM7","v":88.016044686100003}]
["[M}0",null,"",9,"","","","","","","","","","",null,"",null,"","","","","",null,"","","",null,"","","",null,"","","","","N",14.0067,14.0030740074,{"$f":"IF(OR($P$4=\"ave\",$P$4=\"ave>p\"),AK14,AL14)","v":14.0030740074},"-O/-S/deamination",12,"-O","-S","-NH+O",{"$f":"-AM7","v":-15.9949146223},{"$f":"-AM8","v":-31.972070729999999},{"$f":"AM7-AM14-AM2","v":0.98401558299999925}]
[null,"ladder (nt)","",10,"","","","","","","","","","",null,"",null,"","","","","",null,"","","",null,"","","",null,"","","","","G base",151.12629999999999,151.04940999999999,{"$f":"IF(OR($P$4=\"ave\",$P$4=\"ave>p\"),AK15,AL15)","v":151.04940999999999},"+H2O/-m7G/-m7G+H2O",13,"+H2O","-m7G","-m7G+H2O",{"$f":"AM2*2+AM7","v":18.0105646861},{"$f":"-AM15-AM6","v":-165.06506006379999},{"$f":"AM2*2+AM7-AM15-AM6","v":-147.05449537769999}]
[null,3,"",11,"","","","","","","","","","",null,"",null,{"$f":"IF(ISNUMBER($P16),($P16+R$5*$AM$2)/ABS(R$5),\"\")","v":""},"","","","",null,"","","",null,"","","",null,"","","","","Ser",105.09258,105.04259309759999,{"$f":"IF(OR($P$4=\"ave\",$P$4=\"ave>p\"),AK16,AL16)","v":105.04259309759999},"+O/+2O/+3O",14,"+O","+2O","+3O",{"$f":"AM7","v":15.9949146223},{"$f":"AM7*2","v":31.989829244599999},{"$f":"AM7*3","v":47.984743866899997}]
[null,null,"",12,"","","","","","","","","","",null,"",null,"","","","","",null,"","","",null,"","","",null,"","","","","Sec",168.05318,168.9642005753,168.9642005753,"+H2O/+H2O2/+H2O3",15,"+H2O","+H2O2","+H2O3",{"$f":"AM2*2+AM7","v":18.0105646861},{"$f":"AM2*2+AM7*2","v":34.005479308399998},{"$f":"AM2*2+AM7*3","v":50.0003939307}]
["3' end of 3' ladder",null,"",13,"","","","","","","","","","",null,"",null,"","","","","",null,"","","",null,"","","",null,"","","","","Glu",147.1293,147.05315540000001,147.05315540000001,"Sec+Ac/Sec+2Ac/Ser+Ac",16,"Sec+Ac","Sec+2Ac","Ser+Ac",{"$f":"AM17-AM2*2-AM7+AM11","v":192.9641958892},{"$f":"AM17-AM2*2-AM7+AM11*2","v":234.9747558892},{"$f":"AM16-AM2*2-AM7+AM11","v":129.04258841149999}]
[null,"-OH","",14,"","","","","","","","","","",null,"",null,"","","","","",null,"","","",null,"","","",null,"","","","","C",12.0107,12,12,"+AcGlu/Glu/hydroxyGlut",17,"+AcGlu","+Glu","+2HG",{"$f":"AM11+AM18-AM2*2-AM7","v":171.05315071390001},{"$f":"AM18-AM2*2-AM7","v":129.04259071390001},{"$f":"AM18-AM2*3-AM14","v":130.02660629690001}]
[null,null,"",15,"","","","","","","","","","",null,"",null,"","","","","",null,"","","",null,"","","",null,"","","","",null,null,null,null,"bisulfite",18,"+H2SO3","+2H2SO3","unknown+215.319",{"$f":"AM2*2+AM8+AM7*3","v":81.972464660699998},{"$f":"AS20*2","v":163.9449293214},215.31899999999999]
[null,null,"",16,"","","","","","","","","","",null,"",null,"","","","","",null,"","","",null,"","","",null,"","","","",null,null,null,null,"yW_1",19,"yW-58","yW-72","yW-86",{"$f":"-$AM$19*2-$AM$2*2-$AM$7*2","v":-58.005479308399998},{"$f":"AS21-$AM$6","v":-72.021129372199994},{"$f":"AT21-$AM$6","v":-86.036779435999989}]
[null,null,"",17,"","","","","","","","","","",null,"",null,"","","","","",null,"","","",null,"","","",null,"","","","",null,null,null,null,"yW_2",20,"imG-14(yW-187)","m1G(yW-211)","OHyW (yW+16)",{"$f":"-$AM$19*8-$AM$2*13-$AM$7*4-$AM$14","v":-187.08445791129998},{"$f":"AS22-$AM$19*2","v":-211.08445791129998},{"$f":"$AM$7","v":15.9949146223}]
[null,null,"",18,"","","","","","","","","","",null,"",null,"","","","","",null,"","","",null,"","","",null,"","","",""]
[null,null,"",19,"","","","","","","","","","",null,"",null,"","","","","",null,"","","",null,"","","",null,"","","",""]
[null,null,"",20,"","","","","","","","","","",null,"",null,"","","","","",null,"","","",null,"","","",null,"","","",""]
[null,null,"",21,"","","","","","","","","","",null,"",null,{"$f":"IF(ISNUMBER($P26),($P26+R$5*$AM$2)/ABS(R$5),\"\")","v":""},"","","","",null,{"$f":"IF(ISNUMBER($P26),($P26+X$5*$AM$2+$Y$4)/ABS(X$5),\"\")","v":""},"","",null,{"$f":"IF(ISNUMBER($P26),($P26+AB$5*$AM$2+$AC$4)/ABS(AB$5),\"\")","v":""},"","",null,{"$f":"IF(ISNUMBER($P26),($P26+AF$5*$AM$2+$AG$4)/ABS(AF$5),\"\")","v":""},"","",""]
[null,null,"",22,"","","","","","","","","","",null,"",null,"","","","","",null,"","","",null,"","","",null,"","","",""]
[null,null,"",23,"","","","","","","","","","",null,"",null,"","","","","",null,"","","",null,"","","",null,"","","",""]
[null,null,"",24,"","","","","","","","","","",null,"",null,"","","","","",null,"","","",null,"","","",null,"","","",""]
[null,null,"",25,"","","","","","","","","","",null,"",null,"","","","","",null,"","","",null,"","","",null,"","","",""]
[null,null,"",26,"","","","","","","","","","",null,"",null,"","","","","",null,"","","",null,"","","",null,"","","",""]
[null,"保存確認","",27,"","","","","","","","","","",null,"",null,"","","","","",null,"","","",null,"","","",null,"","","",""]
[null,"しない","",28,"","","","","","","","","","",null,"",null,"","","","","",null,"","","",null,"","","",null,"","","",""]
[null,"重複断片","",29,"","","","","","","","","","",null,"",null,"","","","","",null,"","","",null,"","","",null,"","","",""]
[null,"Ignore","",30,"","","","","","","","","","",null,"",null,"","","","","",null,"","","",null,"","","",null,"","","",""]
[null,null,"",31,"","","","","","","","","","",null,"",null,{"$f":"IF(ISNUMBER($P36),($P36+R$5*$AM$2)/ABS(R$5),\"\")","v":""},"","","","",null,"","","",null,"","","",null,"","","",""]
[null,null,"",32,"","","","","","","","","","",null,"",null,"","","","","",null,"","","",null,"","","",null,"","","",""]
[null,null,"",33,"","","","","","","","","","",null,"",null,"","","","","",null,"","","",null,"","","",null,"","","",""]
["全切断パターン設定",null,"",34,"","","","","","","","","","",null,"",null,"","","","","",null,"","","",null,"","","",null,"","","",""]
[19,"塩基以上","",35,"","","","","","","","","","",null,"",null,"","","","","",null,"","","",null,"","","",null,"","","",""]
[24,"塩基以下","",36,"","","","","","","","","","",null,"",null,"","","","","",null,"","","",null,"","","",null,"","","",""]
["生じる5'","p-","",37,"","","","","","","","","","",null,"",null,"","","","","",null,"","","",null,"","","",null,"","","",""]
["生じる3'は「ラダーの3'末端」で指定",null,"",38,"","","","","","","","","","",null,"",null,"","","","","",null,"","","",null,"","","",null,"","","",""]
[null,null,"",39,"","","","","","","","","","",null,"",null,"","","","","",null,"","","",null,"","","",null,"","","",""]
[null,null,"",40,"","","","","","","","","","",null,"",null,"","","","","",null,"","","",null,"","","",null,"","","",""]
[null,null,"",41,"","","","","","","","","","",null,"",null,{"$f":"IF(ISNUMBER($P46),($P46+R$5*$AM$2)/ABS(R$5),\"\")","v":""},"","","","",null,{"$f":"IF(ISNUMBER($P46),($P46+X$5*$AM$2+$Y$4)/ABS(X$5),\"\")","v":""},"","",null,{"$f":"IF(ISNUMBER($P46),($P46+AB$5*$AM$2+$AC$4)/ABS(AB$5),\"\")","v":""},"","",null,{"$f":"IF(ISNUMBER($P46),($P46+AF$5*$AM$2+$AG$4)/ABS(AF$5),\"\")","v":""},"","",""]
[null,null,"",42,"","","","","","","","","","",null,"",null,"","","","","",null,"","","",null,"","","",null,"","","",""]
[null,null,"",43,"","","","","","","","","","",null,"",null,"","","","","",null,"","","",null,"","","",null,"","","",""]
[null,null,"",44,"","","","","","","","","","",null,"",null,"","","","","",null,"","","",null,"","","",null,"","","",""]
[null,null,"",45,"","","","","","","","","","",null,"",null,"","","","","",null,"","","",null,"","","",null,"","","",""]
[null,null,"",46,"","","","","","","","","","",null,"",null,"","","","","",null,"","","",null,"","","",null,"","","",""]
[null,null,"",47,"","","","","","","","","","",null,"",null,"","","","","",null,"","","",null,"","","",null,"","","",""]
[null,null,"",48,"","","","","","","","","","",null,"",null,"","","","","",null,"","","",null,"","","",null,"","","",""]
[null,null,"",49,"","","","","","","","","","",null,"",null,"","","","","",null,"","","",null,"","","",null,"","","",""]
[null,null,"",50,"","","","","","","","","","",null,"",null,"","","","","",null,"","","",null,"","","",null,"","","",""]
[null,null,"",51,"","","","","","","","","","",null,"",null,{"$f":"IF(ISNUMBER($P56),($P56+R$5*$AM$2)/ABS(R$5),\"\")","v":""},"","","","",null,"","","",null,"","","",null,"","","",""]
[null,null,"",52,"","","","","","","","","","",null,"",null,"","","","","",null,"","","",null,"","","",null,"","","",""]
[null,null,"",53,"","","","","","","","","","",null,"",null,"","","","","",null,"","","",null,"","","",null,"","","",""]
[null,null,"",54,"","","","","","","","","","",null,"",null,"","","","","",null,"","","",null,"","","",null,"","","",""]
[null,null,"",55,"","","","","","","","","","",null,"",null,"","","","","",null,"","","",null,"","","",null,"","","",""]
[null,null,"",56,"","","","","","","","","","",null,"",null,"","","","","",null,"","","",null,"","","",null,"","","",""]
[null,null,"",57,"","","","","","","","","","",null,"",null,"","","","","",null,"","","",null,"","","",null,"","","",""]
[null,null,"",58,"","","","","","","","","","",null,"",null,"","","","","",null,"","","",null,"","","",null,"","","",""]
[null,null,"",59,"","","","","","","","","","",null,"",null,"","","","","",null,"","","",null,"","","",null,"","","",""]
[null,null,"",60,"","","","","","","","","","",null,"",null,"","","","","",null,"","","",null,"","","",null,"","","",""]
[null,null,"",61,"","","","","","","","","","",null,"",null,{"$f":"IF(ISNUMBER($P66),($P66+R$5*$AM$2)/ABS(R$5),\"\")","v":""},"","","","",null,{"$f":"IF(ISNUMBER($P66),($P66+X$5*$AM$2+$Y$4)/ABS(X$5),\"\")","v":""},"","",null,{"$f":"IF(ISNUMBER($P66),($P66+AB$5*$AM$2+$AC$4)/ABS(AB$5),\"\")","v":""},"","",null,{"$f":"IF(ISNUMBER($P66),($P66+AF$5*$AM$2+$AG$4)/ABS(AF$5),\"\")","v":""},"","",""]
[null,null,"",62,"","","","","","","","","","",null,"",null,"","","","","",null,"","","",null,"","","",null,"","","",""]
[null,null,"",63,"","","","","","","","","","",null,"",null,"","","","","",null,"","","",null,"","","",null,"","","",""]
[null,null,"",64,"","","","","","","","","","",null,"",null,"","","","","",null,"","","",null,"","","",null,"","","",""]
[null,null,"",65,{"$f":"IF(ISNUMBER(MATCH(D70,INDIRECT($A$7&\"!\"&$E$4&\"$7:\"&$E$4&\"$651\"),0)),MATCH(D70,INDIRECT($A$7&\"!\"&$E$4&\"$7:\"&$E$4&\"$651\"),0),\"\")","v":""},{"$f":"IF(ISNUMBER($E70),INDEX(INDIRECT($A$7&\"!h$7:h$651\"),$E70,1),\"\")","v":""},{"$f":"IF(ISNUMBER($E70),$F70&\" : \"&INDEX(INDIRECT($A$7&\"!i$7:i$651\"),$E70,1),\"\")","v":""},"",{"$f":"IF(ISNUMBER($E70),INDEX(INDIRECT($A$7&\"!k$7:k$651\"),$E70,1),\"\")","v":""},{"$f":"IF(ISNUMBER($E70),INDEX(INDIRECT($A$7&\"!l$7:l$651\"),$E70,1),\"\")","v":""},{"$f":"IF(ISNUMBER($E70),INDEX(INDIRECT($A$7&\"!m$7:m$651\"),$E70,1),\"\")","v":""},{"$f":"IF(ISNUMBER($E70),INDEX(INDIRECT($A$7&\"!n$7:n$651\"),$E70,1),\"\")","v":""},{"$f":"IF(ISNUMBER($E70),INDEX(INDIRECT($A$7&\"!o$7:o$651\"),$E70,1),\"\")","v":""},{"$f":"IF(ISNUMBER($E70),INDEX(INDIRECT($A$7&\"!p$7:p$651\"),$E70,1),\"\")","v":""},null,{"$f":"OFFSET(I70,0,P$5)","v":""},null,"","","","","",null,"","","",null,"","","",null,"","","",""]
[null,null,{"$f":"IF(ISNUMBER(E71),C70+1,\"\")","v":""},66,"","","",{"$f":"IF(ISNUMBER($E71),INDEX(INDIRECT($A$7&\"!DC$7:DC$651\"),$E71,1),\"\")","v":""},"","","","","","",null,"",null,"","","","","",null,"","","",null,"","","",null,"","","",{"$f":"IF(ISNUMBER($E71),INDEX(INDIRECT($A$7&\"!CZ$7:CZ$651\"),$E71,1),\"\")","v":""}]
[null,null,"",67,"","","","","","","","","","",null,"",null,"","","","","",null,"","","",null,"","","",null,"","","",""]
[null,null,"",68,"","","","","","","","","","",null,"",null,"","","","","",null,"","","",null,"","","",null,"","","",""]
[null,null,"",69,"","","","","","","","","","",null,"",null,"","","","","",null,"","","",null,"","","",null,"","","",""]
[null,null,"",70,"","","","","","","","","","",null,"",null,"","","","","",null,"","","",null,"","","",null,"","","",""]
[null,null,"",71,"","","","","","","","","","",null,"",null,{"$f":"IF(ISNUMBER($P76),($P76+R$5*$AM$2)/ABS(R$5),\"\")","v":""},"","","","",null,"","","",null,"","","",null,"","","",""]
[null,null,"",72,"","","","","","","","","","",null,"",null,"","","","","",null,"","","",null,"","","",null,"","","",""]
[null,null,"",73,"","","","","","","","","","",null,"",null,"","","","","",null,"","","",null,"","","",null,"","","",""]
[null,null,"",74,"","","","","","","","","","",null,"",null,"","","","","",null,"","","",null,"","","",null,"","","",""]
[null,null,"",75,"","","","","","","","","","",null,"",null,"","","","","",null,"","","",null,"","","",null,"","","",""]
[null,null,"",76,"","","","","","","","","","",null,"",null,"","","","","",null,"","","",null,"","","",null,"","","",""]
[null,null,"",77,"","","","","","","","","","",null,"",null,"","","","","",null,"","","",null,"","","",null,"","","",""]
[null,null,"",78,"","","","","","","","","","",null,"",null,"","","","","",null,"","","",null,"","","",null,"","","",""]
[null,null,"",79,"","","","","","","","","","",null,"",null,"","","","","",null,"","","",null,"","","",null,"","","",""]
[null,null,"",80,"","","","","","","","","","",null,"",null,"","","","","",null,"","","",null,"","","",null,"","","",""]
[null,null,"",81,"","","","","","","","","","",null,"",null,{"$f":"IF(ISNUMBER($P86),($P86+R$5*$AM$2)/ABS(R$5),\"\")","v":""},"","","","",null,{"$f":"IF(ISNUMBER($P86),($P86+X$5*$AM$2+$Y$4)/ABS(X$5),\"\")","v":""},"","",null,{"$f":"IF(ISNUMBER($P86),($P86+AB$5*$AM$2+$AC$4)/ABS(AB$5),\"\")","v":""},"","",null,{"$f":"IF(ISNUMBER($P86),($P86+AF$5*$AM$2+$AG$4)/ABS(AF$5),\"\")","v":""},"","",""]
[null,null,"",82,"","","","","","","","","","",null,"",null,"","","","","",null,"","","",null,"","","",null,"","","",""]
[null,null,"",83,"","","","","","","","","","",null,"",null,"","","","","",null,"","","",null,"","","",null,"","","",""]
[null,null,"",84,"","","","","","","","","","",null,"",null,"","","","","",null,"","","",null,"","","",null,"","","",""]
[null,null,"",85,"","","","","","","","","","",null,"",null,"","","","","",null,"","","",null,"","","",null,"","","",""]
[null,null,"",86,"","","","","","","","","","",null,"",null,"","","","","",null,"","","",null,"","","",null,"","","",""]
[null,null,"",87,"","","","","","","","","","",null,"",null,"","","","","",null,"","","",null,"","","",null,"","","",""]
[null,null,"",88,"","","","","","","","","","",null,"",null,"","","","","",null,"","","",null,"","","",null,"","","",""]
[null,null,"",89,"","","","","","","","","","",null,"",null,"","","","","",null,"","","",null,"","","",null,"","","",""]
[null,null,"",90,"","","","","","","","","","",null,"",null,"","","","","",null,"","","",null,"","","",null,"","","",""]
[null,null,"",91,"","","","","","","","","","",null,"",null,{"$f":"IF(ISNUMBER($P96),($P96+R$5*$AM$2)/ABS(R$5),\"\")","v":""},"","","","",null,"","","",null,"","","",null,"","","",""]
[null,null,"",92,"","","","","","","","","","",null,"",null,"","","","","",null,"","","",null,"","","",null,"","","",""]
[null,null,"",93,"","","","","","","","","","",null,"",null,"","","","","",null,"","","",null,"","","",null,"","","",""]
[null,null,"",94,"","","","","","","","","","",null,"",null,"","","","","",null,"","","",null,"","","",null,"","","",""]
[null,null,"",95,"","","","","","","","","","",null,"",null,"","","","","",null,"","","",null,"","","",null,"","","",""]
[null,null,"",96,"","","","","","","","","","",null,"",null,"","","","","",null,"","","",null,"","","",null,"","","",""]
[null,null,"",97,"","","","","","","","","","",null,"",null,"","","","","",null,"","","",null,"","","",null,"","","",""]
[null,null,"",98,"","","","","","","","","","",null,"",null,"","","","","",null,"","","",null,"","","",null,"","","",""]
[null,null,"",99,"","","","","","","","","","",null,"",null,"","","","","",null,"","","",null,"","","",null,"","","",""]
[null,null,"",100,"","","","","","","","","","",null,"",null,"","","","","",null,"","","",null,"","","",null,"","","",""]
[null,null,"",101,"","","","","","","","","","",null,"",null,{"$f":"IF(ISNUMBER($P106),($P106+R$5*$AM$2)/ABS(R$5),\"\")","v":""},"","","","",null,{"$f":"IF(ISNUMBER($P106),($P106+X$5*$AM$2+$Y$4)/ABS(X$5),\"\")","v":""},"","",null,{"$f":"IF(ISNUMBER($P106),($P106+AB$5*$AM$2+$AC$4)/ABS(AB$5),\"\")","v":""},"","",null,{"$f":"IF(ISNUMBER($P106),($P106+AF$5*$AM$2+$AG$4)/ABS(AF$5),\"\")","v":""},"","",""]
[null,null,"",102,"","","","","","","","","","",null,"",null,"","","","","",null,"","","",null,"","","",null,"","","",""]
[null,null,"",103,"","","","","","","","","","",null,"",null,"","","","","",null,"","","",null,"","","",null,"","","",""]
[null,null,"",104,"","","","","","","","","","",null,"",null,"","","","","",null,"","","",null,"","","",null,"","","",""]
[null,null,"",105,"","","","","","","","","","",null,"",null,"","","","","",null,"","","",null,"","","",null,"","","",""]
[null,null,"",106,"","","","","","","","","","",null,"",null,"","","","","",null,"","","",null,"","","",null,"","","",""]
[null,null,"",107,"","","","","","","","","","",null,"",null,"","","","","",null,"","","",null,"","","",null,"","","",""]
[null,null,"",108,"","","","","","","","","","",null,"",null,"","","","","",null,"","","",null,"","","",null,"","","",""]
[null,null,"",109,"","","","","","","","","","",null,"",null,"","","","","",null,"","","",null,"","","",null,"","","",""]
[null,null,"",110,"","","","","","","","","","",null,"",null,"","","","","",null,"","","",null,"","","",null,"","","",""]
[null,null,"",111,"","","","","","","","","","",null,"",null,{"$f":"IF(ISNUMBER($P116),($P116+R$5*$AM$2)/ABS(R$5),\"\")","v":""},"","","","",null,"","","",null,"","","",null,"","","",""]
[null,null,"",112,"","","","","","","","","","",null,"",null,"","","","","",null,"","","",null,"","","",null,"","","",""]
[null,null,"",113,"","","","","","","","","","",null,"",null,"","","","","",null,"","","",null,"","","",null,"","","",""]
[null,null,"",114,"","","","","","","","","","",null,"",null,"","","","","",null,"","","",null,"","","",null,"","","",""]
[null,null,"",115,"","","","","","","","","","",null,"",null,"","","","","",null,"","","",null,"","","",null,"","","",""]
[null,null,"",116,"","","","","","","","","","",null,"",null,"","","","","",null,"","","",null,"","","",null,"","","",""]
[null,null,"",117,"","","","","","","","","","",null,"",null,"","","","","",null,"","","",null,"","","",null,"","","",""]
[null,null,"",118,"","","","","","","","","","",null,"",null,"","","","","",null,"","","",null,"","","",null,"","","",""]
[null,null,"",119,"","","","","","","","","","",null,"",null,"","","","","",null,"","","",null,"","","",null,"","","",""]
[null,null,"",120,"","","","","","","","","","",null,"",null,"","","","","",null,"","","",null,"","","",null,"","","",""]
[null,null,"",121,"","","","","","","","","","",null,"",null,{"$f":"IF(ISNUMBER($P126),($P126+R$5*$AM$2)/ABS(R$5),\"\")","v":""},"","","","",null,{"$f":"IF(ISNUMBER($P126),($P126+X$5*$AM$2+$Y$4)/ABS(X$5),\"\")","v":""},"","",null,{"$f":"IF(ISNUMBER($P126),($P126+AB$5*$AM$2+$AC$4)/ABS(AB$5),\"\")","v":""},"","",null,{"$f":"IF(ISNUMBER($P126),($P126+AF$5*$AM$2+$AG$4)/ABS(AF$5),\"\")","v":""},"","",""]
[null,null,"",122,"","","","","","","","","","",null,"",null,"","","","","",null,"","","",null,"","","",null,"","","",""]
[null,null,"",123,"","","","","","","","","","",null,"",null,"","","","","",null,"","","",null,"","","",null,"","","",""]
[null,null,"",124,"","","","","","","","","","",null,"",null,"","","","","",null,"","","",null,"","","",null,"","","",""]
[null,null,"",125,"","","","","","","","","","",null,"",null,"","","","","",null,"","","",null,"","","",null,"","","",""]
[null,null,"",126,"","","","","","","","","","",null,"",null,"","","","","",null,"","","",null,"","","",null,"","","",""]
[null,null,"",127,"","","","","","","","","","",null,"",null,"","","","","",null,"","","",null,"","","",null,"","","",""]
[null,null,"",128,"","","","","","","","","","",null,"",null,"","","","","",null,"","","",null,"","","",null,"","","",""]
[null,null,"",129,{"$f":"IF(ISNUMBER(MATCH(D134,INDIRECT($A$7&\"!\"&$E$4&\"$7:\"&$E$4&\"$651\"),0)),MATCH(D134,INDIRECT($A$7&\"!\"&$E$4&\"$7:\"&$E$4&\"$651\"),0),\"\")","v":""},{"$f":"IF(ISNUMBER($E134),INDEX(INDIRECT($A$7&\"!h$7:h$651\"),$E134,1),\"\")","v":""},{"$f":"IF(ISNUMBER($E134),$F134&\" : \"&INDEX(INDIRECT($A$7&\"!i$7:i$651\"),$E134,1),\"\")","v":""},"",{"$f":"IF(ISNUMBER($E134),INDEX(INDIRECT($A$7&\"!k$7:k$651\"),$E134,1),\"\")","v":""},{"$f":"IF(ISNUMBER($E134),INDEX(INDIRECT($A$7&\"!l$7:l$651\"),$E134,1),\"\")","v":""},{"$f":"IF(ISNUMBER($E134),INDEX(INDIRECT($A$7&\"!m$7:m$651\"),$E134,1),\"\")","v":""},{"$f":"IF(ISNUMBER($E134),INDEX(INDIRECT($A$7&\"!n$7:n$651\"),$E134,1),\"\")","v":""},{"$f":"IF(ISNUMBER($E134),INDEX(INDIRECT($A$7&\"!o$7:o$651\"),$E134,1),\"\")","v":""},{"$f":"IF(ISNUMBER($E134),INDEX(INDIRECT($A$7&\"!p$7:p$651\"),$E134,1),\"\")","v":""},null,{"$f":"OFFSET(I134,0,P$5)","v":""},null,"","","","","",null,"","","",null,"","","",null,"","","",""]
[null,null,{"$f":"IF(ISNUMBER(E135),C134+1,\"\")","v":""},130,"","","",{"$f":"IF(ISNUMBER($E135),INDEX(INDIRECT($A$7&\"!DC$7:DC$651\"),$E135,1),\"\")","v":""},"","","","","","",null,"",null,"","","","","",null,"","","",null,"","","",null,"","","",{"$f":"IF(ISNUMBER($E135),INDEX(INDIRECT($A$7&\"!CZ$7:CZ$651\"),$E135,1),\"\")","v":""}]
[null,null,"",131,"","","","","","","","","","",null,"",null,{"$f":"IF(ISNUMBER($P136),($P136+R$5*$AM$2)/ABS(R$5),\"\")","v":""},"","","","",null,"","","",null,"","","",null,"","","",""]
[null,null,"",132,"","","","","","","","","","",null,"",null,"","","","","",null,"","","",null,"","","",null,"","","",""]
[null,null,"",133,"","","","","","","","","","",null,"",null,"","","","","",null,"","","",null,"","","",null,"","","",""]
[null,null,"",134,"","","","","","","","","","",null,"",null,"","","","","",null,"","","",null,"","","",null,"","","",""]
[null,null,"",135,"","","","","","","","","","",null,"",null,"","","","","",null,"","","",null,"","","",null,"","","",""]
[null,null,"",136,"","","","","","","","","","",null,"",null,"","","","","",null,"","","",null,"","","",null,"","","",""]
[null,null,"",137,"","","","","","","","","","",null,"",null,"","","","","",null,"","","",null,"","","",null,"","","",""]
[null,null,"",138,"","","","","","","","","","",null,"",null,"","","","","",null,"","","",null,"","","",null,"","","",""]
[null,null,"",139,"","","","","","","","","","",null,"",null,"","","","","",null,"","","",null,"","","",null,"","","",""]
[null,null,"",140,"","","","","","","","","","",null,"",null,"","","","","",null,"","","",null,"","","",null,"","","",""]
[null,null,"",141,"","","","","","","","","","",null,"",null,{"$f":"IF(ISNUMBER($P146),($P146+R$5*$AM$2)/ABS(R$5),\"\")","v":""},"","","","",null,{"$f":"IF(ISNUMBER($P146),($P146+X$5*$AM$2+$Y$4)/ABS(X$5),\"\")","v":""},"","",null,{"$f":"IF(ISNUMBER($P146),($P146+AB$5*$AM$2+$AC$4)/ABS(AB$5),\"\")","v":""},"","",null,{"$f":"IF(ISNUMBER($P146),($P146+AF$5*$AM$2+$AG$4)/ABS(AF$5),\"\")","v":""},"","",""]
[null,null,"",142,"","","","","","","","","","",null,"",null,"","","","","",null,"","","",null,"","","",null,"","","",""]
[null,null,"",143,"","","","","","","","","","",null,"",null,"","","","","",null,"","","",null,"","","",null,"","","",""]
[null,null,"",144,"","","","","","","","","","",null,"",null,"","","","","",null,"","","",null,"","","",null,"","","",""]
[null,null,"",145,"","","","","","","","","","",null,"",null,"","","","","",null,"","","",null,"","","",null,"","","",""]
[null,null,"",146,"","","","","","","","","","",null,"",null,"","","","","",null,"","","",null,"","","",null,"","","",""]
[null,null,"",147,"","","","","","","","","","",null,"",null,"","","","","",null,"","","",null,"","","",null,"","","",""]
[null,null,"",148,"","","","","","","","","","",null,"",null,"","","","","",null,"","","",null,"","","",null,"","","",""]
[null,null,"",149,"","","","","","","","","","",null,"",null,"","","","","",null,"","","",null,"","","",null,"","","",""]
[null,null,"",150,"","","","","","","","","","",null,"",null,"","","","","",null,"","","",null,"","","",null,"","","",""]
[null,null,"",151,"","","","","","","","","","",null,"",null,{"$f":"IF(ISNUMBER($P156),($P156+R$5*$AM$2)/ABS(R$5),\"\")","v":""},"","","","",null,"","","",null,"","","",null,"","","",""]
[null,null,"",152,"","","","","","","","","","",null,"",null,"","","","","",null,"","","",null,"","","",null,"","","",""]
[null,null,"",153,"","","","","","","","","","",null,"",null,"","","","","",null,"","","",null,"","","",null,"","","",""]
[null,null,"",154,"","","","","","","","","","",null,"",null,"","","","","",null,"","","",null,"","","",null,"","","",""]
[null,null,"",155,"","","","","","","","","","",null,"",null,"","","","","",null,"","","",null,"","","",null,"","","",""]
[null,null,"",156,"","","","","","","","","","",null,"",null,"","","","","",null,"","","",null,"","","",null,"","","",""]
[null,null,"",157,"","","","","","","","","","",null,"",null,"","","","","",null,"","","",null,"","","",null,"","","",""]
[null,null,"",158,"","","","","","","","","","",null,"",null,"","","","","",null,"","","",null,"","","",null,"","","",""]
[null,null,"",159,"","","","","","","","","","",null,"",null,"","","","","",null,"","","",null,"","","",null,"","","",""]
[null,null,"",160,"","","","","","","","","","",null,"",null,"","","","","",null,"","","",null,"","","",null,"","","",""]
[null,null,"",161,"","","","","","","","","","",null,"",null,{"$f":"IF(ISNUMBER($P166),($P166+R$5*$AM$2)/ABS(R$5),\"\")","v":""},"","","","",null,{"$f":"IF(ISNUMBER($P166),($P166+X$5*$AM$2+$Y$4)/ABS(X$5),\"\")","v":""},"","",null,{"$f":"IF(ISNUMBER($P166),($P166+AB$5*$AM$2+$AC$4)/ABS(AB$5),\"\")","v":""},"","",null,{"$f":"IF(ISNUMBER($P166),($P166+AF$5*$AM$2+$AG$4)/ABS(AF$5),\"\")","v":""},"","",""]
[null,null,"",162,"","","","","","","","","","",null,"",null,"","","","","",null,"","","",null,"","","",null,"","","",""]
[null,null,"",163,"","","","","","","","","","",null,"",null,"","","","","",null,"","","",null,"","","",null,"","","",""]
[null,null,"",164,"","","","","","","","","","",null,"",null,"","","","","",null,"","","",null,"","","",null,"","","",""]
[null,null,"",165,"","","","","","","","","","",null,"",null,"","","","","",null,"","","",null,"","","",null,"","","",""]
[null,null,"",166,"","","","","","","","","","",null,"",null,"","","","","",null,"","","",null,"","","",null,"","","",""]
[null,null,"",167,"","","","","","","","","","",null,"",null,"","","","","",null,"","","",null,"","","",null,"","","",""]
[null,null,"",168,"","","","","","","","","","",null,"",null,"","","","","",null,"","","",null,"","","",null,"","","",""]
[null,null,"",169,"","","","","","","","","","",null,"",null,"","","","","",null,"","","",null,"","","",null,"","","",""]
[null,null,"",170,"","","","","","","","","","",null,"",null,"","","","","",null,"","","",null,"","","",null,"","","",""]
[null,null,"",171,"","","","","","","","","","",null,"",null,{"$f":"IF(ISNUMBER($P176),($P176+R$5*$AM$2)/ABS(R$5),\"\")","v":""},"","","","",null,"","","",null,"","","",null,"","","",""]
[null,null,"",172,"","","","","","","","","","",null,"",null,"","","","","",null,"","","",null,"","","",null,"","","",""]
[null,null,"",173,"","","","","","","","","","",null,"",null,"","","","","",null,"","","",null,"","","",null,"","","",""]
[null,null,"",174,"","","","","","","","","","",null,"",null,"","","","","",null,"","","",null,"","","",null,"","","",""]
[null,null,"",175,"","","","","","","","","","",null,"",null,"","","","","",null,"","","",null,"","","",null,"","","",""]
[null,null,"",176,"","","","","","","","","","",null,"",null,"","","","","",null,"","","",null,"","","",null,"","","",""]
[null,null,"",177,"","","","","","","","","","",null,"",null,"","","","","",null,"","","",null,"","","",null,"","","",""]
[null,null,"",178,"","","","","","","","","","",null,"",null,"","","","","",null,"","","",null,"","","",null,"","","",""]
[null,null,"",179,"","","","","","","","","","",null,"",null,"","","","","",null,"","","",null,"","","",null,"","","",""]
[null,null,"",180,"","","","","","","","","","",null,"",null,"","","","","",null,"","","",null,"","","",null,"","","",""]
[null,null,"",181,"","","","","","","","","","",null,"",null,{"$f":"IF(ISNUMBER($P186),($P186+R$5*$AM$2)/ABS(R$5),\"\")","v":""},"","","","",null,{"$f":"IF(ISNUMBER($P186),($P186+X$5*$AM$2+$Y$4)/ABS(X$5),\"\")","v":""},"","",null,{"$f":"IF(ISNUMBER($P186),($P186+AB$5*$AM$2+$AC$4)/ABS(AB$5),\"\")","v":""},"","",null,{"$f":"IF(ISNUMBER($P186),($P186+AF$5*$AM$2+$AG$4)/ABS(AF$5),\"\")","v":""},"","",""]
[null,null,"",182,"","","","","","","","","","",null,"",null,"","","","","",null,"","","",null,"","","",null,"","","",""]
[null,null,"",183,"","","","","","","","","","",null,"",null,"","","","","",null,"","","",null,"","","",null,"","","",""]
[null,null,"",184,"","","","","","","","","","",null,"",null,"","","","","",null,"","","",null,"","","",null,"","","",""]
[null,null,"",185,"","","","","","","","","","",null,"",null,"","","","","",null,"","","",null,"","","",null,"","","",""]
[null,null,"",186,"","","","","","","","","","",null,"",null,"","","","","",null,"","","",null,"","","",null,"","","",""]
[null,null,"",187,"","","","","","","","","","",null,"",null,"","","","","",null,"","","",null,"","","",null,"","","",""]
[null,null,"",188,"","","","","","","","","","",null,"",null,"","","","","",null,"","","",null,"","","",null,"","","",""]
[null,null,"",189,"","","","","","","","","","",null,"",null,"","","","","",null,"","","",null,"","","",null,"","","",""]
[null,null,"",190,"","","","","","","","","","",null,"",null,"","","","","",null,"","","",null,"","","",null,"","","",""]
[null,null,"",191,"","","","","","","","","","",null,"",null,{"$f":"IF(ISNUMBER($P196),($P196+R$5*$AM$2)/ABS(R$5),\"\")","v":""},"","","","",null,"","","",null,"","","",null,"","","",""]
[null,null,"",192,"","","","","","","","","","",null,"",null,"","","","","",null,"","","",null,"","","",null,"","","",""]
[null,null,"",193,{"$f":"IF(ISNUMBER(MATCH(D198,INDIRECT($A$7&\"!\"&$E$4&\"$7:\"&$E$4&\"$651\"),0)),MATCH(D198,INDIRECT($A$7&\"!\"&$E$4&\"$7:\"&$E$4&\"$651\"),0),\"\")","v":""},{"$f":"IF(ISNUMBER($E198),INDEX(INDIRECT($A$7&\"!h$7:h$651\"),$E198,1),\"\")","v":""},{"$f":"IF(ISNUMBER($E198),$F198&\" : \"&INDEX(INDIRECT($A$7&\"!i$7:i$651\"),$E198,1),\"\")","v":""},"",{"$f":"IF(ISNUMBER($E198),INDEX(INDIRECT($A$7&\"!k$7:k$651\"),$E198,1),\"\")","v":""},{"$f":"IF(ISNUMBER($E198),INDEX(INDIRECT($A$7&\"!l$7:l$651\"),$E198,1),\"\")","v":""},{"$f":"IF(ISNUMBER($E198),INDEX(INDIRECT($A$7&\"!m$7:m$651\"),$E198,1),\"\")","v":""},{"$f":"IF(ISNUMBER($E198),INDEX(INDIRECT($A$7&\"!n$7:n$651\"),$E198,1),\"\")","v":""},{"$f":"IF(ISNUMBER($E198),INDEX(INDIRECT($A$7&\"!o$7:o$651\"),$E198,1),\"\")","v":""},{"$f":"IF(ISNUMBER($E198),INDEX(INDIRECT($A$7&\"!p$7:p$651\"),$E198,1),\"\")","v":""},null,{"$f":"OFFSET(I198,0,P$5)","v":""},null,"","","","","",null,"","","",null,"","","",null,"","","",""]
[null,null,{"$f":"IF(ISNUMBER(E199),C198+1,\"\")","v":""},194,"","","",{"$f":"IF(ISNUMBER($E199),INDEX(INDIRECT($A$7&\"!DC$7:DC$651\"),$E199,1),\"\")","v":""},"","","","","","",null,"",null,"","","","","",null,"","","",null,"","","",null,"","","",{"$f":"IF(ISNUMBER($E199),INDEX(INDIRECT($A$7&\"!CZ$7:CZ$651\"),$E199,1),\"\")","v":""}]
[null,null,"",195,"","","","","","","","","","",null,"",null,"","","","","",null,"","","",null,"","","",null,"","","",""]
[null,null,"",196,"","","","","","","","","","",null,"",null,"","","","","",null,"","","",null,"","","",null,"","","",""]
[null,null,"",197,"","","","","","","","","","",null,"",null,"","","","","",null,"","","",null,"","","",null,"","","",""]
[null,null,"",198,"","","","","","","","","","",null,"",null,"","","","","",null,"","","",null,"","","",null,"","","",""]
[null,null,"",199,"","","","","","","","","","",null,"",null,"","","","","",null,"","","",null,"","","",null,"","","",""]
[null,null,"",200,"","","","","","","","","","",null,"",null,"","","","","",null,"","","",null,"","","",null,"","","",""]
[null,null,"",201,"","","","","","","","","","",null,"",null,{"$f":"IF(ISNUMBER($P206),($P206+R$5*$AM$2)/ABS(R$5),\"\")","v":""},"","","","",null,{"$f":"IF(ISNUMBER($P206),($P206+X$5*$AM$2+$Y$4)/ABS(X$5),\"\")","v":""},"","",null,{"$f":"IF(ISNUMBER($P206),($P206+AB$5*$AM$2+$AC$4)/ABS(AB$5),\"\")","v":""},"","",null,{"$f":"IF(ISNUMBER($P206),($P206+AF$5*$AM$2+$AG$4)/ABS(AF$5),\"\")","v":""},"","",""]
[null,null,"",202,"","","","","","","","","","",null,"",null,"","","","","",null,"","","",null,"","","",null,"","","",""]
[null,null,"",203,"","","","","","","","","","",null,"",null,"","","","","",null,"","","",null,"","","",null,"","","",""]
[null,null,"",204,"","","","","","","","","","",null,"",null,"","","","","",null,"","","",null,"","","",null,"","","",""]
[null,null,"",205,"","","","","","","","","","",null,"",null,"","","","","",null,"","","",null,"","","",null,"","","",""]
[null,null,"",206,"","","","","","","","","","",null,"",null,"","","","","",null,"","","",null,"","","",null,"","","",""]
[null,null,"",207,"","","","","","","","","","",null,"",null,"","","","","",null,"","","",null,"","","",null,"","","",""]
[null,null,"",208,"","","","","","","","","","",null,"",null,"","","","","",null,"","","",null,"","","",null,"","","",""]
[null,null,"",209,"","","","","","","","","","",null,"",null,"","","","","",null,"","","",null,"","","",null,"","","",""]
[null,null,"",210,"","","","","","","","","","",null,"",null,"","","","","",null,"","","",null,"","","",null,"","","",""]
[null,null,"",211,"","","","","","","","","","",null,"",null,{"$f":"IF(ISNUMBER($P216),($P216+R$5*$AM$2)/ABS(R$5),\"\")","v":""},"","","","",null,"","","",null,"","","",null,"","","",""]
[null,null,"",212,"","","","","","","","","","",null,"",null,"","","","","",null,"","","",null,"","","",null,"","","",""]
[null,null,"",213,"","","","","","","","","","",null,"",null,"","","","","",null,"","","",null,"","","",null,"","","",""]
[null,null,"",214,"","","","","","","","","","",null,"",null,"","","","","",null,"","","",null,"","","",null,"","","",""]
[null,null,"",215,"","","","","","","","","","",null,"",null,"","","","","",null,"","","",null,"","","",null,"","","",""]
[null,null,"",216,"","","","","","","","","","",null,"",null,"","","","","",null,"","","",null,"","","",null,"","","",""]
[null,null,"",217,"","","","","","","","","","",null,"",null,"","","","","",null,"","","",null,"","","",null,"","","",""]
[null,null,"",218,"","","","","","","","","","",null,"",null,"","","","","",null,"","","",null,"","","",null,"","","",""]
[null,null,"",219,"","","","","","","","","","",null,"",null,"","","","","",null,"","","",null,"","","",null,"","","",""]
[null,null,"",220,"","","","","","","","","","",null,"",null,"","","","","",null,"","","",null,"","","",null,"","","",""]
[null,null,"",221,"","","","","","","","","","",null,"",null,{"$f":"IF(ISNUMBER($P226),($P226+R$5*$AM$2)/ABS(R$5),\"\")","v":""},"","","","",null,{"$f":"IF(ISNUMBER($P226),($P226+X$5*$AM$2+$Y$4)/ABS(X$5),\"\")","v":""},"","",null,{"$f":"IF(ISNUMBER($P226),($P226+AB$5*$AM$2+$AC$4)/ABS(AB$5),\"\")","v":""},"","",null,{"$f":"IF(ISNUMBER($P226),($P226+AF$5*$AM$2+$AG$4)/ABS(AF$5),\"\")","v":""},"","",""]
[null,null,"",222,"","","","","","","","","","",null,"",null,"","","","","",null,"","","",null,"","","",null,"","","",""]
[null,null,"",223,"","","","","","","","","","",null,"",null,"","","","","",null,"","","",null,"","","",null,"","","",""]
[null,null,"",224,"","","","","","","","","","",null,"",null,"","","","","",null,"","","",null,"","","",null,"","","",""]
[null,null,"",225,"","","","","","","","","","",null,"",null,"","","","","",null,"","","",null,"","","",null,"","","",""]
[null,null,"",226,"","","","","","","","","","",null,"",null,"","","","","",null,"","","",null,"","","",null,"","","",""]
[null,null,"",227,"","","","","","","","","","",null,"",null,"","","","","",null,"","","",null,"","","",null,"","","",""]
[null,null,"",228,"","","","","","","","","","",null,"",null,"","","","","",null,"","","",null,"","","",null,"","","",""]
[null,null,"",229,"","","","","","","","","","",null,"",null,"","","","","",null,"","","",null,"","","",null,"","","",""]
[null,null,"",230,"","","","","","","","","","",null,"",null,"","","","","",null,"","","",null,"","","",null,"","","",""]
[null,null,"",231,"","","","","","","","","","",null,"",null,{"$f":"IF(ISNUMBER($P236),($P236+R$5*$AM$2)/ABS(R$5),\"\")","v":""},"","","","",null,"","","",null,"","","",null,"","","",""]
[null,null,"",232,"","","","","","","","","","",null,"",null,"","","","","",null,"","","",null,"","","",null,"","","",""]
[null,null,"",233,"","","","","","","","","","",null,"",null,"","","","","",null,"","","",null,"","","",null,"","","",""]
[null,null,"",234,"","","","","","","","","","",null,"",null,"","","","","",null,"","","",null,"","","",null,"","","",""]
[null,null,"",235,"","","","","","","","","","",null,"",null,"","","","","",null,"","","",null,"","","",null,"","","",""]
[null,null,"",236,"","","","","","","","","","",null,"",null,"","","","","",null,"","","",null,"","","",null,"","","",""]
[null,null,"",237,"","","","","","","","","","",null,"",null,"","","","","",null,"","","",null,"","","",null,"","","",""]
[null,null,"",238,"","","","","","","","","","",null,"",null,"","","","","",null,"","","",null,"","","",null,"","","",""]
[null,null,"",239,"","","","","","","","","","",null,"",null,"","","","","",null,"","","",null,"","","",null,"","","",""]
[null,null,"",240,"","","","","","","","","","",null,"",null,"","","","","",null,"","","",null,"","","",null,"","","",""]
[null,null,"",241,"","","","","","","","","","",null,"",null,{"$f":"IF(ISNUMBER($P246),($P246+R$5*$AM$2)/ABS(R$5),\"\")","v":""},"","","","",null,{"$f":"IF(ISNUMBER($P246),($P246+X$5*$AM$2+$Y$4)/ABS(X$5),\"\")","v":""},"","",null,{"$f":"IF(ISNUMBER($P246),($P246+AB$5*$AM$2+$AC$4)/ABS(AB$5),\"\")","v":""},"","",null,{"$f":"IF(ISNUMBER($P246),($P246+AF$5*$AM$2+$AG$4)/ABS(AF$5),\"\")","v":""},"","",""]
[null,null,"",242,"","","","","","","","","","",null,"",null,"","","","","",null,"","","",null,"","","",null,"","","",""]
[null,null,"",243,"","","","","","","","","","",null,"",null,"","","","","",null,"","","",null,"","","",null,"","","",""]
[null,null,"",244,"","","","","","","","","","",null,"",null,"","","","","",null,"","","",null,"","","",null,"","","",""]
[null,null,"",245,"","","","","","","","","","",null,"",null,"","","","","",null,"","","",null,"","","",null,"","","",""]
[null,null,"",246,"","","","","","","","","","",null,"",null,"","","","","",null,"","","",null,"","","",null,"","","",""]
[null,null,"",247,"","","","","","","","","","",null,"",null,"","","","","",null,"","","",null,"","","",null,"","","",""]
[null,null,"",248,"","","","","","","","","","",null,"",null,"","","","","",null,"","","",null,"","","",null,"","","",""]
[null,null,"",249,"","","","","","","","","","",null,"",null,"","","","","",null,"","","",null,"","","",null,"","","",""]
[null,null,"",250,"","","","","","","","","","",null,"",null,"","","","","",null,"","","",null,"","","",null,"","","",""]
[null,null,"",251,"","","","","","","","","","",null,"",null,{"$f":"IF(ISNUMBER($P256),($P256+R$5*$AM$2)/ABS(R$5),\"\")","v":""},"","","","",null,"","","",null,"","","",null,"","","",""]
[null,null,"",252,"","","","","","","","","","",null,"",null,"","","","","",null,"","","",null,"","","",null,"","","",""]
[null,null,"",253,"","","","","","","","","","",null,"",null,"","","","","",null,"","","",null,"","","",null,"","","",""]
[null,null,"",254,"","","","","","","","","","",null,"",null,"","","","","",null,"","","",null,"","","",null,"","","",""]
[null,null,"",255,"","","","","","","","","","",null,"",null,"","","","","",null,"","","",null,"","","",null,"","","",""]
[null,null,"",256,"","","","","","","","","","",null,"",null,"","","","","",null,"","","",null,"","","",null,"","","",""]
[null,null,"",257,{"$f":"IF(ISNUMBER(MATCH(D262,INDIRECT($A$7&\"!\"&$E$4&\"$7:\"&$E$4&\"$651\"),0)),MATCH(D262,INDIRECT($A$7&\"!\"&$E$4&\"$7:\"&$E$4&\"$651\"),0),\"\")","v":""},{"$f":"IF(ISNUMBER($E262),INDEX(INDIRECT($A$7&\"!h$7:h$651\"),$E262,1),\"\")","v":""},{"$f":"IF(ISNUMBER($E262),$F262&\" : \"&INDEX(INDIRECT($A$7&\"!i$7:i$651\"),$E262,1),\"\")","v":""},"",{"$f":"IF(ISNUMBER($E262),INDEX(INDIRECT($A$7&\"!k$7:k$651\"),$E262,1),\"\")","v":""},{"$f":"IF(ISNUMBER($E262),INDEX(INDIRECT($A$7&\"!l$7:l$651\"),$E262,1),\"\")","v":""},{"$f":"IF(ISNUMBER($E262),INDEX(INDIRECT($A$7&\"!m$7:m$651\"),$E262,1),\"\")","v":""},{"$f":"IF(ISNUMBER($E262),INDEX(INDIRECT($A$7&\"!n$7:n$651\"),$E262,1),\"\")","v":""},{"$f":"IF(ISNUMBER($E262),INDEX(INDIRECT($A$7&\"!o$7:o$651\"),$E262,1),\"\")","v":""},{"$f":"IF(ISNUMBER($E262),INDEX(INDIRECT($A$7&\"!p$7:p$651\"),$E262,1),\"\")","v":""},null,{"$f":"OFFSET(I262,0,P$5)","v":""},null,"","","","","",null,"","","",null,"","","",null,"","","",""]
[null,null,{"$f":"IF(ISNUMBER(E263),C262+1,\"\")","v":""},258,"","","",{"$f":"IF(ISNUMBER($E263),INDEX(INDIRECT($A$7&\"!DC$7:DC$651\"),$E263,1),\"\")","v":""},"","","","","","",null,"",null,"","","","","",null,"","","",null,"","","",null,"","","",{"$f":"IF(ISNUMBER($E263),INDEX(INDIRECT($A$7&\"!CZ$7:CZ$651\"),$E263,1),\"\")","v":""}]
[null,null,"",259,"","","","","","","","","","",null,"",null,"","","","","",null,"","","",null,"","","",null,"","","",""]
[null,null,"",260,"","","","","","","","","","",null,"",null,"","","","","",null,"","","",null,"","","",null,"","","",""]
[null,null,"",261,"","","","","","","","","","",null,"",null,{"$f":"IF(ISNUMBER($P266),($P266+R$5*$AM$2)/ABS(R$5),\"\")","v":""},"","","","",null,{"$f":"IF(ISNUMBER($P266),($P266+X$5*$AM$2+$Y$4)/ABS(X$5),\"\")","v":""},"","",null,{"$f":"IF(ISNUMBER($P266),($P266+AB$5*$AM$2+$AC$4)/ABS(AB$5),\"\")","v":""},"","",null,{"$f":"IF(ISNUMBER($P266),($P266+AF$5*$AM$2+$AG$4)/ABS(AF$5),\"\")","v":""},"","",""]
[null,null,"",262,"","","","","","","","","","",null,"",null,"","","","","",null,"","","",null,"","","",null,"","","",""]
[null,null,"",263,"","","","","","","","","","",null,"",null,"","","","","",null,"","","",null,"","","",null,"","","",""]
[null,null,"",264,"","","","","","","","","","",null,"",null,"","","","","",null,"","","",null,"","","",null,"","","",""]
[null,null,"",265,"","","","","","","","","","",null,"",null,"","","","","",null,"","","",null,"","","",null,"","","",""]
[null,null,"",266,"","","","","","","","","","",null,"",null,"","","","","",null,"","","",null,"","","",null,"","","",""]
[null,null,"",267,"","","","","","","","","","",null,"",null,"","","","","",null,"","","",null,"","","",null,"","","",""]
[null,null,"",268,"","","","","","","","","","",null,"",null,"","","","","",null,"","","",null,"","","",null,"","","",""]
[null,null,"",269,"","","","","","","","","","",null,"",null,"","","","","",null,"","","",null,"","","",null,"","","",""]
[null,null,"",270,"","","","","","","","","","",null,"",null,"","","","","",null,"","","",null,"","","",null,"","","",""]
[null,null,"",271,"","","","","","","","","","",null,"",null,{"$f":"IF(ISNUMBER($P276),($P276+R$5*$AM$2)/ABS(R$5),\"\")","v":""},"","","","",null,"","","",null,"","","",null,"","","",""]
[null,null,"",272,"","","","","","","","","","",null,"",null,"","","","","",null,"","","",null,"","","",null,"","","",""]
[null,null,"",273,"","","","","","","","","","",null,"",null,"","","","","",null,"","","",null,"","","",null,"","","",""]
[null,null,"",274,"","","","","","","","","","",null,"",null,"","","","","",null,"","","",null,"","","",null,"","","",""]
[null,null,"",275,"","","","","","","","","","",null,"",null,"","","","","",null,"","","",null,"","","",null,"","","",""]
[null,null,"",276,"","","","","","","","","","",null,"",null,"","","","","",null,"","","",null,"","","",null,"","","",""]
[null,null,"",277,"","","","","","","","","","",null,"",null,"","","","","",null,"","","",null,"","","",null,"","","",""]
[null,null,"",278,"","","","","","","","","","",null,"",null,"","","","","",null,"","","",null,"","","",null,"","","",""]
[null,null,"",279,"","","","","","","","","","",null,"",null,"","","","","",null,"","","",null,"","","",null,"","","",""]
[null,null,"",280,"","","","","","","","","","",null,"",null,"","","","","",null,"","","",null,"","","",null,"","","",""]
[null,null,"",281,"","","","","","","","","","",null,"",null,{"$f":"IF(ISNUMBER($P286),($P286+R$5*$AM$2)/ABS(R$5),\"\")","v":""},"","","","",null,{"$f":"IF(ISNUMBER($P286),($P286+X$5*$AM$2+$Y$4)/ABS(X$5),\"\")","v":""},"","",null,{"$f":"IF(ISNUMBER($P286),($P286+AB$5*$AM$2+$AC$4)/ABS(AB$5),\"\")","v":""},"","",null,{"$f":"IF(ISNUMBER($P286),($P286+AF$5*$AM$2+$AG$4)/ABS(AF$5),\"\")","v":""},"","",""]
[null,null,"",282,"","","","","","","","","","",null,"",null,"","","","","",null,"","","",null,"","","",null,"","","",""]
[null,null,"",283,"","","","","","","","","","",null,"",null,"","","","","",null,"","","",null,"","","",null,"","","",""]
[null,null,"",284,"","","","","","","","","","",null,"",null,"","","","","",null,"","","",null,"","","",null,"","","",""]
[null,null,"",285,"","","","","","","","","","",null,"",null,"","","","","",null,"","","",null,"","","",null,"","","",""]
[null,null,"",286,"","","","","","","","","","",null,"",null,"","","","","",null,"","","",null,"","","",null,"","","",""]
[null,null,"",287,"","","","","","","","","","",null,"",null,"","","","","",null,"","","",null,"","","",null,"","","",""]
[null,null,"",288,"","","","","","","","","","",null,"",null,"","","","","",null,"","","",null,"","","",null,"","","",""]
[null,null,"",289,"","","","","","","","","","",null,"",null,"","","","","",null,"","","",null,"","","",null,"","","",""]
[null,null,"",290,"","","","","","","","","","",null,"",null,"","","","","",null,"","","",null,"","","",null,"","","",""]
[null,null,"",291,"","","","","","","","","","",null,"",null,{"$f":"IF(ISNUMBER($P296),($P296+R$5*$AM$2)/ABS(R$5),\"\")","v":""},"","","","",null,"","","",null,"","","",null,"","","",""]
[null,null,"",292,"","","","","","","","","","",null,"",null,"","","","","",null,"","","",null,"","","",null,"","","",""]
[null,null,"",293,"","","","","","","","","","",null,"",null,"","","","","",null,"","","",null,"","","",null,"","","",""]
[null,null,"",294,"","","","","","","","","","",null,"",null,"","","","","",null,"","","",null,"","","",null,"","","",""]
[null,null,"",295,"","","","","","","","","","",null,"",null,"","","","","",null,"","","",null,"","","",null,"","","",""]
[null,null,"",296,"","","","","","","","","","",null,"",null,"","","","","",null,"","","",null,"","","",null,"","","",""]
[null,null,"",297,"","","","","","","","","","",null,"",null,"","","","","",null,"","","",null,"","","",null,"","","",""]
[null,null,"",298,"","","","","","","","","","",null,"",null,"","","","","",null,"","","",null,"","","",null,"","","",""]
[null,null,"",299,"","","","","","","","","","",null,"",null,"","","","","",null,"","","",null,"","","",null,"","","",""]
[null,null,"",300,"","","","","","","","","","",null,"",null,"","","","","",null,"","","",null,"","","",null,"","","",""]
[null,null,"",301,"","","","","","","","","","",null,"",null,{"$f":"IF(ISNUMBER($P306),($P306+R$5*$AM$2)/ABS(R$5),\"\")","v":""},"","","","",null,{"$f":"IF(ISNUMBER($P306),($P306+X$5*$AM$2+$Y$4)/ABS(X$5),\"\")","v":""},"","",null,{"$f":"IF(ISNUMBER($P306),($P306+AB$5*$AM$2+$AC$4)/ABS(AB$5),\"\")","v":""},"","",null,{"$f":"IF(ISNUMBER($P306),($P306+AF$5*$AM$2+$AG$4)/ABS(AF$5),\"\")","v":""},"","",""]
[null,null,"",302,"","","","","","","","","","",null,"",null,"","","","","",null,"","","",null,"","","",null,"","","",""]
[null,null,"",303,"","","","","","","","","","",null,"",null,"","","","","",null,"","","",null,"","","",null,"","","",""]
[null,null,"",304,"","","","","","","","","","",null,"",null,"","","","","",null,"","","",null,"","","",null,"","","",""]
[null,null,"",305,"","","","","","","","","","",null,"",null,"","","","","",null,"","","",null,"","","",null,"","","",""]
[null,null,"",306,"","","","","","","","","","",null,"",null,"","","","","",null,"","","",null,"","","",null,"","","",""]
[null,null,"",307,"","","","","","","","","","",null,"",null,"","","","","",null,"","","",null,"","","",null,"","","",""]
[null,null,"",308,"","","","","","","","","","",null,"",null,"","","","","",null,"","","",null,"","","",null,"","","",""]
[null,null,"",309,"","","","","","","","","","",null,"",null,"","","","","",null,"","","",null,"","","",null,"","","",""]
[null,null,"",310,"","","","","","","","","","",null,"",null,"","","","","",null,"","","",null,"","","",null,"","","",""]
[null,null,"",311,"","","","","","","","","","",null,"",null,{"$f":"IF(ISNUMBER($P316),($P316+R$5*$AM$2)/ABS(R$5),\"\")","v":""},"","","","",null,"","","",null,"","","",null,"","","",""]
[null,null,"",312,"","","","","","","","","","",null,"",null,"","","","","",null,"","","",null,"","","",null,"","","",""]
[null,null,"",313,"","","","","","","","","","",null,"",null,"","","","","",null,"","","",null,"","","",null,"","","",""]
[null,null,"",314,"","","","","","","","","","",null,"",null,"","","","","",null,"","","",null,"","","",null,"","","",""]
[null,null,"",315,"","","","","","","","","","",null,"",null,"","","","","",null,"","","",null,"","","",null,"","","",""]
[null,null,"",316,"","","","","","","","","","",null,"",null,"","","","","",null,"","","",null,"","","",null,"","","",""]
[null,null,"",317,"","","","","","","","","","",null,"",null,"","","","","",null,"","","",null,"","","",null,"","","",""]
[null,null,"",318,"","","","","","","","","","",null,"",null,"","","","","",null,"","","",null,"","","",null,"","","",""]
[null,null,"",319,"","","","","","","","","","",null,"",null,"","","","","",null,"","","",null,"","","",null,"","","",""]
[null,null,"",320,"","","","","","","","","","",null,"",null,"","","","","",null,"","","",null,"","","",null,"","","",""]
[null,null,"",321,{"$f":"IF(ISNUMBER(MATCH(D326,INDIRECT($A$7&\"!\"&$E$4&\"$7:\"&$E$4&\"$651\"),0)),MATCH(D326,INDIRECT($A$7&\"!\"&$E$4&\"$7:\"&$E$4&\"$651\"),0),\"\")","v":""},{"$f":"IF(ISNUMBER($E326),INDEX(INDIRECT($A$7&\"!h$7:h$651\"),$E326,1),\"\")","v":""},{"$f":"IF(ISNUMBER($E326),$F326&\" : \"&INDEX(INDIRECT($A$7&\"!i$7:i$651\"),$E326,1),\"\")","v":""},"",{"$f":"IF(ISNUMBER($E326),INDEX(INDIRECT($A$7&\"!k$7:k$651\"),$E326,1),\"\")","v":""},{"$f":"IF(ISNUMBER($E326),INDEX(INDIRECT($A$7&\"!l$7:l$651\"),$E326,1),\"\")","v":""},{"$f":"IF(ISNUMBER($E326),INDEX(INDIRECT($A$7&\"!m$7:m$651\"),$E326,1),\"\")","v":""},{"$f":"IF(ISNUMBER($E326),INDEX(INDIRECT($A$7&\"!n$7:n$651\"),$E326,1),\"\")","v":""},{"$f":"IF(ISNUMBER($E326),INDEX(INDIRECT($A$7&\"!o$7:o$651\"),$E326,1),\"\")","v":""},{"$f":"IF(ISNUMBER($E326),INDEX(INDIRECT($A$7&\"!p$7:p$651\"),$E326,1),\"\")","v":""},null,{"$f":"OFFSET(I326,0,P$5)","v":""},null,{"$f":"IF(ISNUMBER($P326),($P326+R$5*$AM$2)/ABS(R$5),\"\")","v":""},"","","","",null,{"$f":"IF(ISNUMBER($P326),($P326+X$5*$AM$2+$Y$4)/ABS(X$5),\"\")","v":""},"","",null,{"$f":"IF(ISNUMBER($P326),($P326+AB$5*$AM$2+$AC$4)/ABS(AB$5),\"\")","v":""},"","",null,{"$f":"IF(ISNUMBER($P326),($P326+AF$5*$AM$2+$AG$4)/ABS(AF$5),\"\")","v":""},"","",""]
[null,null,{"$f":"IF(ISNUMBER(E327),C326+1,\"\")","v":""},322,"","","",{"$f":"IF(ISNUMBER($E327),INDEX(INDIRECT($A$7&\"!DC$7:DC$651\"),$E327,1),\"\")","v":""},"","","","","","",null,"",null,"","","","","",null,"","","",null,"","","",null,"","","",{"$f":"IF(ISNUMBER($E327),INDEX(INDIRECT($A$7&\"!CZ$7:CZ$651\"),$E327,1),\"\")","v":""}]
[null,null,"",323,"","","","","","","","","","",null,"",null,"","","","","",null,"","","",null,"","","",null,"","","",""]
[null,null,"",324,"","","","","","","","","","",null,"",null,"","","","","",null,"","","",null,"","","",null,"","","",""]
[null,null,"",325,"","","","","","","","","","",null,"",null,"","","","","",null,"","","",null,"","","",null,"","","",""]
[null,null,"",326,"","","","","","","","","","",null,"",null,"","","","","",null,"","","",null,"","","",null,"","","",""]
[null,null,"",327,"","","","","","","","","","",null,"",null,"","","","","",null,"","","",null,"","","",null,"","","",""]
[null,null,"",328,"","","","","","","","","","",null,"",null,"","","","","",null,"","","",null,"","","",null,"","","",""]
[null,null,"",329,"","","","","","","","","","",null,"",null,"","","","","",null,"","","",null,"","","",null,"","","",""]
[null,null,"",330,"","","","","","","","","","",null,"",null,"","","","","",null,"","","",null,"","","",null,"","","",""]
[null,null,"",331,"","","","","","","","","","",null,"",null,{"$f":"IF(ISNUMBER($P336),($P336+R$5*$AM$2)/ABS(R$5),\"\")","v":""},"","","","",null,"","","",null,"","","",null,"","","",""]
[null,null,"",332,"","","","","","","","","","",null,"",null,"","","","","",null,"","","",null,"","","",null,"","","",""]
[null,null,"",333,"","","","","","","","","","",null,"",null,"","","","","",null,"","","",null,"","","",null,"","","",""]
[null,null,"",334,"","","","","","","","","","",null,"",null,"","","","","",null,"","","",null,"","","",null,"","","",""]
[null,null,"",335,"","","","","","","","","","",null,"",null,"","","","","",null,"","","",null,"","","",null,"","","",""]
[null,null,"",336,"","","","","","","","","","",null,"",null,"","","","","",null,"","","",null,"","","",null,"","","",""]
[null,null,"",337,"","","","","","","","","","",null,"",null,"","","","","",null,"","","",null,"","","",null,"","","",""]
[null,null,"",338,"","","","","","","","","","",null,"",null,"","","","","",null,"","","",null,"","","",null,"","","",""]
[null,null,"",339,"","","","","","","","","","",null,"",null,"","","","","",null,"","","",null,"","","",null,"","","",""]
[null,null,"",340,"","","","","","","","","","",null,"",null,"","","","","",null,"","","",null,"","","",null,"","","",""]
[null,null,"",341,"","","","","","","","","","",null,"",null,"","","","","",null,"","","",null,"","","",null,"","","",""]
[null,null,"",342,"","","","","","","","","","",null,"",null,"","","","","",null,"","","",null,"","","",null,"","","",""]
[null,null,"",343,"","","","","","","","","","",null,"",null,"","","","","",null,"","","",null,"","","",null,"","","",""]
[null,null,"",344,"","","","","","","","","","",null,"",null,"","","","","",null,"","","",null,"","","",null,"","","",""]
[null,null,{"$f":"IF(ISNUMBER(E350),C349+1,\"\")","v":""},345,"","","","","","","","","","",null,{"$f":"OFFSET(I350,0,P$5)","v":""},null,"","","","","",null,"","","",null,"","","",null,"","","",""]
[null,null,"",346,"","","","","","","","","","",null,"",null,"","","","","",null,{"$f":"IF(ISNUMBER($P351),($P351+X$5*$AM$2+$Y$4)/ABS(X$5),\"\")","v":""},"","",null,{"$f":"IF(ISNUMBER($P351),($P351+AB$5*$AM$2+$AC$4)/ABS(AB$5),\"\")","v":""},"","",null,{"$f":"IF(ISNUMBER($P351),($P351+AF$5*$AM$2+$AG$4)/ABS(AF$5),\"\")","v":""},"","",""]
[null,null,"",347,"","","","","","","","","","",null,"",null,{"$f":"IF(ISNUMBER($P352),($P352+R$5*$AM$2)/ABS(R$5),\"\")","v":""},"","","","",null,"","","",null,"","","",null,"","","",""]
[null,null,"",348,"","","","","","","","","","",null,"",null,"","","","","",null,"","","",null,"","","",null,"","","",""]
[null,null,"",349,"","","","","","","","","","",null,"",null,"","","","","",null,"","","",null,"","","",null,"","","",""]
[null,null,"",350,"","","","","","","","","","",null,"",null,"","","","","",null,"","","",null,"","","",null,"","","",""]
[null,null,"",351,"","","","","","","","","","",null,"",null,"","","","","",null,"","","",null,"","","",null,"","","",""]
[null,null,"",352,"","","","","","","","","","",null,"",null,"","","","","",null,"","","",null,"","","",null,"","","",""]
[null,null,"",353,"","","","","","","","","","",null,"",null,"","","","","",null,"","","",null,"","","",null,"","","",""]
[null,null,"",354,"","","","","","","","","","",null,"",null,"","","","","",null,"","","",null,"","","",null,"","","",""]
[null,null,"",355,"","","","","","","","","","",null,"",null,"","","","","",null,"","","",null,"","","",null,"","","",""]
[null,null,"",356,"","","","","","","","","","",null,"",null,"","","","","",null,"","","",null,"","","",null,"","","",""]
[null,null,"",357,"","","","","","","","","","",null,"",null,"","","","","",null,"","","",null,"","","",null,"","","",""]
[null,null,"",358,"","","","","","","","","","",null,"",null,"","","","","",null,"","","",null,"","","",null,"","","",""]
[null,null,"",359,"","","","","","","","","","",null,"",null,"","","","","",null,"","","",null,"","","",null,"","","",""]
[null,null,"",360,"","","","","","","","","","",null,"",null,"","","","","",null,"","","",null,"","","",null,"","","",""]
[null,null,"",361,"","","","","","","","","","",null,"",null,"","","","","",null,"","","",null,"","","",null,"","","",""]
[null,null,"",362,"","","","","","","","","","",null,"",null,"","","","","",null,"","","",null,"","","",null,"","","",""]
[null,null,"",363,"","","","","","","","","","",null,"",null,"","","","","",null,"","","",null,"","","",null,"","","",""]
[null,null,"",364,"","","","","","","","","","",null,"",null,"","","","","",null,"","","",null,"","","",null,"","","",""]
[null,null,"",365,"","","","","","","","","","",null,"",null,"","","","","",null,"","","",null,"","","",null,"","","",""]
[null,null,"",366,"","","","","","","","","","",null,"",null,"","","","","",null,"","","",null,"","","",null,"","","",""]
[null,null,"",367,"","","","","","","","","","",null,"",null,"","","","","",null,"","","",null,"","","",null,"","","",""]
[null,null,"",368,"","","","","","","","","","",null,"",null,"","","","","",null,"","","",null,"","","",null,"","","",""]
[null,null,"",369,"","","","","","","","","","",null,"",null,"","","","","",null,"","","",null,"","","",null,"","","",""]
[null,null,"",370,"","","","","","","","","","",null,"",null,"","","","","",null,"","","",null,"","","",null,"","","",""]
[null,null,"",371,"","","","","","","","","","",null,"",null,"","","","","",null,"","","",null,"","","",null,"","","",""]
[null,null,"",372,"","","","","","","","","","",null,"",null,"","","","","",null,"","","",null,"","","",null,"","","",""]
[null,null,"",373,"","","","","","","","","","",null,"",null,"","","","","",null,"","","",null,"","","",null,"","","",""]
[null,null,"",374,"","","","","","","","","","",null,"",null,"","","","","",null,"","","",null,"","","",null,"","","",""]
[null,null,"",375,"","","","","","","","","","",null,"",null,"","","","","",null,"","","",null,"","","",null,"","","",""]
[null,null,"",376,"","","","","","","","","","",null,"",null,"","","","","",null,"","","",null,"","","",null,"","","",""]
[null,null,"",377,"","","","","","","","","","",null,"",null,"","","","","",null,"","","",null,"","","",null,"","","",""]
[null,null,"",378,"","","","","","","","","","",null,"",null,"","","","","",null,"","","",null,"","","",null,"","","",""]
[null,null,"",379,"","","","","","","","","","",null,"",null,"","","","","",null,"","","",null,"","","",null,"","","",""]
[null,null,"",380,"","","","","","","","","","",null,"",null,"","","","","",null,"","","",null,"","","",null,"","","",""]
[null,null,"",381,"","","","","","","","","","",null,"",null,"","","","","",null,"","","",null,"","","",null,"","","",""]
[null,null,"",382,"","","","","","","","","","",null,"",null,"","","","","",null,"","","",null,"","","",null,"","","",""]
[null,null,"",383,"","","","","","","","","","",null,"",null,"","","","","",null,"","","",null,"","","",null,"","","",""]
[null,null,"",384,"","","","","","","","","","",null,"",null,"","","","","",null,"","","",null,"","","",null,"","","",""]
[null,null,"",385,{"$f":"IF(ISNUMBER(MATCH(D390,INDIRECT($A$7&\"!\"&$E$4&\"$7:\"&$E$4&\"$651\"),0)),MATCH(D390,INDIRECT($A$7&\"!\"&$E$4&\"$7:\"&$E$4&\"$651\"),0),\"\")","v":""},{"$f":"IF(ISNUMBER($E390),INDEX(INDIRECT($A$7&\"!h$7:h$651\"),$E390,1),\"\")","v":""},{"$f":"IF(ISNUMBER($E390),$F390&\" : \"&INDEX(INDIRECT($A$7&\"!i$7:i$651\"),$E390,1),\"\")","v":""},"",{"$f":"IF(ISNUMBER($E390),INDEX(INDIRECT($A$7&\"!k$7:k$651\"),$E390,1),\"\")","v":""},{"$f":"IF(ISNUMBER($E390),INDEX(INDIRECT($A$7&\"!l$7:l$651\"),$E390,1),\"\")","v":""},{"$f":"IF(ISNUMBER($E390),INDEX(INDIRECT($A$7&\"!m$7:m$651\"),$E390,1),\"\")","v":""},{"$f":"IF(ISNUMBER($E390),INDEX(INDIRECT($A$7&\"!n$7:n$651\"),$E390,1),\"\")","v":""},{"$f":"IF(ISNUMBER($E390),INDEX(INDIRECT($A$7&\"!o$7:o$651\"),$E390,1),\"\")","v":""},{"$f":"IF(ISNUMBER($E390),INDEX(INDIRECT($A$7&\"!p$7:p$651\"),$E390,1),\"\")","v":""},null,"",null,"","","","","",null,"","","",null,"","","",null,"","","",""]
[null,null,"",386,"","","",{"$f":"IF(ISNUMBER($E391),INDEX(INDIRECT($A$7&\"!DC$7:DC$651\"),$E391,1),\"\")","v":""},"","","","","","",null,"",null,"","","","","",null,"","","",null,"","","",null,"","","",{"$f":"IF(ISNUMBER($E391),INDEX(INDIRECT($A$7&\"!CZ$7:CZ$651\"),$E391,1),\"\")","v":""}]
[null,null,"",387,"","","","","","","","","","",null,"",null,"","","","","",null,"","","",null,"","","",null,"","","",""]
[null,null,"",388,"","","","","","","","","","",null,"",null,"","","","","",null,"","","",null,"","","",null,"","","",""]
[null,null,"",389,"","","","","","","","","","",null,"",null,"","","","","",null,"","","",null,"","","",null,"","","",""]
[null,null,"",390,"","","","","","","","","","",null,"",null,"","","","","",null,"","","",null,"","","",null,"","","",""]
[null,null,"",391,"","","","","","","","","","",null,"",null,"","","","","",null,"","","",null,"","","",null,"","","",""]
[null,null,"",392,"","","","","","","","","","",null,"",null,"","","","","",null,"","","",null,"","","",null,"","","",""]
[null,null,"",393,"","","","","","","","","","",null,"",null,"","","","","",null,"","","",null,"","","",null,"","","",""]
[null,null,"",394,"","","","","","","","","","",null,"",null,"","","","","",null,"","","",null,"","","",null,"","","",""]
[null,null,"",395,"","","","","","","","","","",null,"",null,"","","","","",null,"","","",null,"","","",null,"","","",""]
[null,null,"",396,"","","","","","","","","","",null,"",null,"","","","","",null,"","","",null,"","","",null,"","","",""]
[null,null,"",397,"","","","","","","","","","",null,"",null,"","","","","",null,"","","",null,"","","",null,"","","",""]
[null,null,"",398,"","","","","","","","","","",null,"",null,{"$f":"IF(ISNUMBER($P403),($P403+R$5*$AM$2)/ABS(R$5),\"\")","v":""},"","","","",null,"","","",null,"","","",null,"","","",""]
[null,null,"",399,"","","","","","","","","","",null,"",null,"","","","","",null,"","","",null,"","","",null,"","","",""]
[null,null,"",400,"","","","","","","","","","",null,"",null,"","","","","",null,"","","",null,"","","",null,"","","",""]
[null,null,"",401,"","","","","","","","","","",null,"",null,"","","","","",null,"","","",null,"","","",null,"","","",""]
[null,null,"",402,"","","","","","","","","","",null,"",null,"","","","","",null,"","","",null,"","","",null,"","","",""]
[null,null,"",403,"","","","","","","","","","",null,"",null,"","","","","",null,"","","",null,"","","",null,"","","",""]
[null,null,"",404,"","","","","","","","","","",null,"",null,"","","","","",null,"","","",null,"","","",null,"","","",""]
[null,null,"",405,"","","","","","","","","","",null,"",null,"","","","","",null,"","","",null,"","","",null,"","","",""]
[null,null,"",406,"","","","","","","","","","",null,"",null,"","","","","",null,"","","",null,"","","",null,"","","",""]
[null,null,"",407,"","","","","","","","","","",null,"",null,"","","","","",null,"","","",null,"","","",null,"","","",""]
[null,null,"",408,"","","","","","","","","","",null,"",null,"","","","","",null,"","","",null,"","","",null,"","","",""]
[null,null,{"$f":"IF(ISNUMBER(E414),C413+1,\"\")","v":""},409,"","","","","","","","","","",null,{"$f":"OFFSET(I414,0,P$5)","v":""},null,"","","","","",null,"","","",null,"","","",null,"","","",""]
[null,null,"",410,"","","","","","","","","","",null,"",null,"","","","","",null,{"$f":"IF(ISNUMBER($P415),($P415+X$5*$AM$2+$Y$4)/ABS(X$5),\"\")","v":""},"","",null,{"$f":"IF(ISNUMBER($P415),($P415+AB$5*$AM$2+$AC$4)/ABS(AB$5),\"\")","v":""},"","",null,{"$f":"IF(ISNUMBER($P415),($P415+AF$5*$AM$2+$AG$4)/ABS(AF$5),\"\")","v":""},"","",""]
[null,null,"",411,"","","","","","","","","","",null,"",null,"","","","","",null,"","","",null,"","","",null,"","","",""]
[null,null,"",412,"","","","","","","","","","",null,"",null,"","","","","",null,"","","",null,"","","",null,"","","",""]
[null,null,"",413,"","","","","","","","","","",null,"",null,"","","","","",null,"","","",null,"","","",null,"","","",""]
[null,null,"",414,"","","","","","","","","","",null,"",null,"","","","","",null,"","","",null,"","","",null,"","","",""]
[null,null,"",415,"","","","","","","","","","",null,"",null,"","","","","",null,"","","",null,"","","",null,"","","",""]
[null,null,"",416,"","","","","","","","","","",null,"",null,"","","","","",null,"","","",null,"","","",null,"","","",""]
[null,null,"",417,"","","","","","","","","","",null,"",null,"","","","","",null,"","","",null,"","","",null,"","","",""]
[null,null,"",418,"","","","","","","","","","",null,"",null,"","","","","",null,"","","",null,"","","",null,"","","",""]
[null,null,"",419,"","","","","","","","","","",null,"",null,"","","","","",null,"","","",null,"","","",null,"","","",""]
[null,null,"",420,"","","","","","","","","","",null,"",null,"","","","","",null,"","","",null,"","","",null,"","","",""]
[null,null,"",421,"","","","","","","","","","",null,"",null,"","","","","",null,"","","",null,"","","",null,"","","",""]
[null,null,"",422,"","","","","","","","","","",null,"",null,"","","","","",null,"","","",null,"","","",null,"","","",""]
[null,null,"",423,"","","","","","","","","","",null,"",null,"","","","","",null,"","","",null,"","","",null,"","","",""]
[null,null,"",424,"","","","","","","","","","",null,"",null,"","","","","",null,"","","",null,"","","",null,"","","",""]
[null,null,"",425,"","","","","","","","","","",null,"",null,"","","","","",null,"","","",null,"","","",null,"","","",""]
[null,null,"",426,"","","","","","","","","","",null,"",null,"","","","","",null,"","","",null,"","","",null,"","","",""]
[null,null,"",427,"","","","","","","","","","",null,"",null,"","","","","",null,"","","",null,"","","",null,"","","",""]
[null,null,"",428,"","","","","","","","","","",null,"",null,"","","","","",null,"","","",null,"","","",null,"","","",""]
[null,null,"",429,"","","","","","","","","","",null,"",null,"","","","","",null,"","","",null,"","","",null,"","","",""]
[null,null,"",430,"","","","","","","","","","",null,"",null,"","","","","",null,"","","",null,"","","",null,"","","",""]
[null,null,"",431,"","","","","","","","","","",null,"",null,"","","","","",null,"","","",null,"","","",null,"","","",""]
[null,null,"",432,"","","","","","","","","","",null,"",null,"","","","","",null,"","","",null,"","","",null,"","","",""]
[null,null,"",433,"","","","","","","","","","",null,"",null,"","","","","",null,"","","",null,"","","",null,"","","",""]
[null,null,"",434,"","","","","","","","","","",null,"",null,"","","","","",null,"","","",null,"","","",null,"","","",""]
[null,null,"",435,"","","","","","","","","","",null,"",null,"","","","","",null,"","","",null,"","","",null,"","","",""]
[null,null,"",436,"","","","","","","","","","",null,"",null,"","","","","",null,"","","",null,"","","",null,"","","",""]
[null,null,"",437,"","","","","","","","","","",null,"",null,"","","","","",null,"","","",null,"","","",null,"","","",""]
[null,null,"",438,"","","","","","","","","","",null,"",null,"","","","","",null,"","","",null,"","","",null,"","","",""]
[null,null,"",439,"","","","","","","","","","",null,"",null,"","","","","",null,"","","",null,"","","",null,"","","",""]
[null,null,"",440,"","","","","","","","","","",null,"",null,"","","","","",null,"","","",null,"","","",null,"","","",""]
[null,null,"",441,"","","","","","","","","","",null,"",null,"","","","","",null,"","","",null,"","","",null,"","","",""]
[null,null,"",442,"","","","","","","","","","",null,"",null,"","","","","",null,"","","",null,"","","",null,"","","",""]
[null,null,"",443,"","","","","","","","","","",null,"",null,"","","","","",null,"","","",null,"","","",null,"","","",""]
[null,null,"",444,"","","","","","","","","","",null,"",null,"","","","","",null,"","","",null,"","","",null,"","","",""]
[null,null,"",445,"","","","","","","","","","",null,"",null,"","","","","",null,"","","",null,"","","",null,"","","",""]
[null,null,"",446,"","","","","","","","","","",null,"",null,"","","","","",null,"","","",null,"","","",null,"","","",""]
[null,null,"",447,"","","","","","","","","","",null,"",null,"","","","","",null,"","","",null,"","","",null,"","","",""]
[null,null,"",448,"","","","","","","","","","",null,"",null,"","","","","",null,"","","",null,"","","",null,"","","",""]
[null,null,"",449,{"$f":"IF(ISNUMBER(MATCH(D454,INDIRECT($A$7&\"!\"&$E$4&\"$7:\"&$E$4&\"$651\"),0)),MATCH(D454,INDIRECT($A$7&\"!\"&$E$4&\"$7:\"&$E$4&\"$651\"),0),\"\")","v":""},{"$f":"IF(ISNUMBER($E454),INDEX(INDIRECT($A$7&\"!h$7:h$651\"),$E454,1),\"\")","v":""},{"$f":"IF(ISNUMBER($E454),$F454&\" : \"&INDEX(INDIRECT($A$7&\"!i$7:i$651\"),$E454,1),\"\")","v":""},"",{"$f":"IF(ISNUMBER($E454),INDEX(INDIRECT($A$7&\"!k$7:k$651\"),$E454,1),\"\")","v":""},{"$f":"IF(ISNUMBER($E454),INDEX(INDIRECT($A$7&\"!l$7:l$651\"),$E454,1),\"\")","v":""},{"$f":"IF(ISNUMBER($E454),INDEX(INDIRECT($A$7&\"!m$7:m$651\"),$E454,1),\"\")","v":""},{"$f":"IF(ISNUMBER($E454),INDEX(INDIRECT($A$7&\"!n$7:n$651\"),$E454,1),\"\")","v":""},{"$f":"IF(ISNUMBER($E454),INDEX(INDIRECT($A$7&\"!o$7:o$651\"),$E454,1),\"\")","v":""},{"$f":"IF(ISNUMBER($E454),INDEX(INDIRECT($A$7&\"!p$7:p$651\"),$E454,1),\"\")","v":""},null,"",null,{"$f":"IF(ISNUMBER($P454),($P454+R$5*$AM$2)/ABS(R$5),\"\")","v":""},"","","","",null,"","","",null,"","","",null,"","","",""]
[null,null,"",450,"","","",{"$f":"IF(ISNUMBER($E455),INDEX(INDIRECT($A$7&\"!DC$7:DC$651\"),$E455,1),\"\")","v":""},"","","","","","",null,"",null,"","","","","",null,"","","",null,"","","",null,"","","",{"$f":"IF(ISNUMBER($E455),INDEX(INDIRECT($A$7&\"!CZ$7:CZ$651\"),$E455,1),\"\")","v":""}]
[null,null,"",451,"","","","","","","","","","",null,"",null,"","","","","",null,"","","",null,"","","",null,"","","",""]
[null,null,"",452,"","","","","","","","","","",null,"",null,"","","","","",null,"","","",null,"","","",null,"","","",""]
[null,null,"",453,"","","","","","","","","","",null,"",null,"","","","","",null,"","","",null,"","","",null,"","","",""]
[null,null,"",454,"","","","","","","","","","",null,"",null,"","","","","",null,"","","",null,"","","",null,"","","",""]
[null,null,"",455,"","","","","","","","","","",null,"",null,"","","","","",null,"","","",null,"","","",null,"","","",""]
[null,null,"",456,"","","","","","","","","","",null,"",null,"","","","","",null,"","","",null,"","","",null,"","","",""]
[null,null,"",457,"","","","","","","","","","",null,"",null,"","","","","",null,"","","",null,"","","",null,"","","",""]
[null,null,"",458,"","","","","","","","","","",null,"",null,"","","","","",null,"","","",null,"","","",null,"","","",""]
[null,null,"",459,"","","","","","","","","","",null,"",null,"","","","","",null,"","","",null,"","","",null,"","","",""]
[null,null,"",460,"","","","","","","","","","",null,"",null,"","","","","",null,"","","",null,"","","",null,"","","",""]
[null,null,"",461,"","","","","","","","","","",null,"",null,"","","","","",null,"","","",null,"","","",null,"","","",""]
[null,null,"",462,"","","","","","","","","","",null,"",null,"","","","","",null,"","","",null,"","","",null,"","","",""]
[null,null,"",463,"","","","","","","","","","",null,"",null,"","","","","",null,"","","",null,"","","",null,"","","",""]
[null,null,"",464,"","","","","","","","","","",null,"",null,"","","","","",null,"","","",null,"","","",null,"","","",""]
[null,null,"",465,"","","","","","","","","","",null,"",null,"","","","","",null,"","","",null,"","","",null,"","","",""]
[null,null,"",466,"","","","","","","","","","",null,"",null,"","","","","",null,"","","",null,"","","",null,"","","",""]
[null,null,"",467,"","","","","","","","","","",null,"",null,"","","","","",null,"","","",null,"","","",null,"","","",""]
[null,null,"",468,"","","","","","","","","","",null,"",null,"","","","","",null,"","","",null,"","","",null,"","","",""]
[null,null,"",469,"","","","","","","","","","",null,"",null,"","","","","",null,"","","",null,"","","",null,"","","",""]
[null,null,"",470,"","","","","","","","","","",null,"",null,"","","","","",null,"","","",null,"","","",null,"","","",""]
[null,null,"",471,"","","","","","","","","","",null,"",null,"","","","","",null,"","","",null,"","","",null,"","","",""]
[null,null,"",472,"","","","","","","","","","",null,"",null,"","","","","",null,"","","",null,"","","",null,"","","",""]
[null,null,{"$f":"IF(ISNUMBER(E478),C477+1,\"\")","v":""},473,"","","","","","","","","","",null,{"$f":"OFFSET(I478,0,P$5)","v":""},null,"","","","","",null,"","","",null,"","","",null,"","","",""]
[null,null,"",474,"","","","","","","","","","",null,"",null,"","","","","",null,{"$f":"IF(ISNUMBER($P479),($P479+X$5*$AM$2+$Y$4)/ABS(X$5),\"\")","v":""},"","",null,{"$f":"IF(ISNUMBER($P479),($P479+AB$5*$AM$2+$AC$4)/ABS(AB$5),\"\")","v":""},"","",null,{"$f":"IF(ISNUMBER($P479),($P479+AF$5*$AM$2+$AG$4)/ABS(AF$5),\"\")","v":""},"","",""]
[null,null,"",475,"","","","","","","","","","",null,"",null,"","","","","",null,"","","",null,"","","",null,"","","",""]
[null,null,"",476,"","","","","","","","","","",null,"",null,"","","","","",null,"","","",null,"","","",null,"","","",""]
[null,null,"",477,"","","","","","","","","","",null,"",null,"","","","","",null,"","","",null,"","","",null,"","","",""]
[null,null,"",478,"","","","","","","","","","",null,"",null,"","","","","",null,"","","",null,"","","",null,"","","",""]
[null,null,"",479,"","","","","","","","","","",null,"",null,"","","","","",null,"","","",null,"","","",null,"","","",""]
[null,null,"",480,"","","","","","","","","","",null,"",null,"","","","","",null,"","","",null,"","","",null,"","","",""]
[null,null,"",481,"","","","","","","","","","",null,"",null,"","","","","",null,"","","",null,"","","",null,"","","",""]
[null,null,"",482,"","","","","","","","","","",null,"",null,"","","","","",null,"","","",null,"","","",null,"","","",""]
[null,null,"",483,"","","","","","","","","","",null,"",null,"","","","","",null,"","","",null,"","","",null,"","","",""]
[null,null,"",484,"","","","","","","","","","",null,"",null,"","","","","",null,"","","",null,"","","",null,"","","",""]
[null,null,"",485,"","","","","","","","","","",null,"",null,"","","","","",null,"","","",null,"","","",null,"","","",""]
[null,null,"",486,"","","","","","","","","","",null,"",null,"","","","","",null,"","","",null,"","","",null,"","","",""]
[null,null,"",487,"","","","","","","","","","",null,"",null,"","","","","",null,"","","",null,"","","",null,"","","",""]
[null,null,"",488,"","","","","","","","","","",null,"",null,"","","","","",null,"","","",null,"","","",null,"","","",""]
[null,null,"",489,"","","","","","","","","","",null,"",null,"","","","","",null,"","","",null,"","","",null,"","","",""]
[null,null,"",490,"","","","","","","","","","",null,"",null,"","","","","",null,"","","",null,"","","",null,"","","",""]
[null,null,"",491,"","","","","","","","","","",null,"",null,"","","","","",null,"","","",null,"","","",null,"","","",""]
[null,null,"",492,"","","","","","","","","","",null,"",null,"","","","","",null,"","","",null,"","","",null,"","","",""]
[null,null,"",493,"","","","","","","","","","",null,"",null,"","","","","",null,"","","",null,"","","",null,"","","",""]
[null,null,"",494,"","","","","","","","","","",null,"",null,"","","","","",null,"","","",null,"","","",null,"","","",""]
[null,null,"",495,"","","","","","","","","","",null,"",null,"","","","","",null,"","","",null,"","","",null,"","","",""]
[null,null,"",496,"","","","","","","","","","",null,"",null,"","","","","",null,"","","",null,"","","",null,"","","",""]
[null,null,"",497,"","","","","","","","","","",null,"",null,"","","","","",null,"","","",null,"","","",null,"","","",""]
[null,null,"",498,"","","","","","","","","","",null,"",null,"","","","","",null,"","","",null,"","","",null,"","","",""]
[null,null,"",499,"","","","","","","","","","",null,"",null,"","","","","",null,"","","",null,"","","",null,"","","",""]
[null,null,"",500,"","","","","","","","","","",null,"",null,{"$f":"IF(ISNUMBER($P505),($P505+R$5*$AM$2)/ABS(R$5),\"\")","v":""},"","","","",null,"","","",null,"","","",null,"","","",""]
[null,null,"",501,"","","","","","","","","","",null,"",null,"","","","","",null,"","","",null,"","","",null,"","","",""]
[null,null,"",502,"","","","","","","","","","",null,"",null,"","","","","",null,"","","",null,"","","",null,"","","",""]
[null,null,"",503,"","","","","","","","","","",null,"",null,"","","","","",null,"","","",null,"","","",null,"","","",""]
[null,null,"",504,"","","","","","","","","","",null,"",null,"","","","","",null,"","","",null,"","","",null,"","","",""]
[null,null,"",505,"","","","","","","","","","",null,"",null,"","","","","",null,"","","",null,"","","",null,"","","",""]
[null,null,"",506,"","","","","","","","","","",null,"",null,"","","","","",null,"","","",null,"","","",null,"","","",""]
[null,null,"",507,"","","","","","","","","","",null,"",null,"","","","","",null,"","","",null,"","","",null,"","","",""]
[null,null,"",508,"","","","","","","","","","",null,"",null,"","","","","",null,"","","",null,"","","",null,"","","",""]
[null,null,"",509,"","","","","","","","","","",null,"",null,"","","","","",null,"","","",null,"","","",null,"","","",""]
[null,null,"",510,"","","","","","","","","","",null,"",null,"","","","","",null,"","","",null,"","","",null,"","","",""]
[null,null,"",511,"","","","","","","","","","",null,"",null,"","","","","",null,"","","",null,"","","",null,"","","",""]
[null,null,"",512,"","","","","","","","","","",null,"",null,"","","","","",null,"","","",null,"","","",null,"","","",""]
[null,null,"",513,{"$f":"IF(ISNUMBER(MATCH(D518,INDIRECT($A$7&\"!\"&$E$4&\"$7:\"&$E$4&\"$651\"),0)),MATCH(D518,INDIRECT($A$7&\"!\"&$E$4&\"$7:\"&$E$4&\"$651\"),0),\"\")","v":""},{"$f":"IF(ISNUMBER($E518),INDEX(INDIRECT($A$7&\"!h$7:h$651\"),$E518,1),\"\")","v":""},{"$f":"IF(ISNUMBER($E518),$F518&\" : \"&INDEX(INDIRECT($A$7&\"!i$7:i$651\"),$E518,1),\"\")","v":""},"",{"$f":"IF(ISNUMBER($E518),INDEX(INDIRECT($A$7&\"!k$7:k$651\"),$E518,1),\"\")","v":""},{"$f":"IF(ISNUMBER($E518),INDEX(INDIRECT($A$7&\"!l$7:l$651\"),$E518,1),\"\")","v":""},{"$f":"IF(ISNUMBER($E518),INDEX(INDIRECT($A$7&\"!m$7:m$651\"),$E518,1),\"\")","v":""},{"$f":"IF(ISNUMBER($E518),INDEX(INDIRECT($A$7&\"!n$7:n$651\"),$E518,1),\"\")","v":""},{"$f":"IF(ISNUMBER($E518),INDEX(INDIRECT($A$7&\"!o$7:o$651\"),$E518,1),\"\")","v":""},{"$f":"IF(ISNUMBER($E518),INDEX(INDIRECT($A$7&\"!p$7:p$651\"),$E518,1),\"\")","v":""},null,"",null,"","","","","",null,"","","",null,"","","",null,"","","",""]
[null,null,"",514,"","","",{"$f":"IF(ISNUMBER($E519),INDEX(INDIRECT($A$7&\"!DC$7:DC$651\"),$E519,1),\"\")","v":""},"","","","","","",null,"",null,"","","","","",null,"","","",null,"","","",null,"","","",{"$f":"IF(ISNUMBER($E519),INDEX(INDIRECT($A$7&\"!CZ$7:CZ$651\"),$E519,1),\"\")","v":""}]
[null,null,"",515,"","","","","","","","","","",null,"",null,"","","","","",null,"","","",null,"","","",null,"","","",""]
[null,null,"",516,"","","","","","","","","","",null,"",null,"","","","","",null,"","","",null,"","","",null,"","","",""]
[null,null,"",517,"","","","","","","","","","",null,"",null,"","","","","",null,"","","",null,"","","",null,"","","",""]
[null,null,"",518,"","","","","","","","","","",null,"",null,"","","","","",null,"","","",null,"","","",null,"","","",""]
[null,null,"",519,"","","","","","","","","","",null,"",null,"","","","","",null,"","","",null,"","","",null,"","","",""]
[null,null,"",520,"","","","","","","","","","",null,"",null,"","","","","",null,"","","",null,"","","",null,"","","",""]
[null,null,"",521,"","","","","","","","","","",null,"",null,"","","","","",null,"","","",null,"","","",null,"","","",""]
[null,null,"",522,"","","","","","","","","","",null,"",null,"","","","","",null,"","","",null,"","","",null,"","","",""]
[null,null,"",523,"","","","","","","","","","",null,"",null,"","","","","",null,"","","",null,"","","",null,"","","",""]
[null,null,"",524,"","","","","","","","","","",null,"",null,"","","","","",null,"","","",null,"","","",null,"","","",""]
[null,null,"",525,"","","","","","","","","","",null,"",null,"","","","","",null,"","","",null,"","","",null,"","","",""]
[null,null,"",526,"","","","","","","","","","",null,"",null,"","","","","",null,"","","",null,"","","",null,"","","",""]
[null,null,"",527,"","","","","","","","","","",null,"",null,"","","","","",null,"","","",null,"","","",null,"","","",""]
[null,null,"",528,"","","","","","","","","","",null,"",null,"","","","","",null,"","","",null,"","","",null,"","","",""]
[null,null,"",529,"","","","","","","","","","",null,"",null,"","","","","",null,"","","",null,"","","",null,"","","",""]
[null,null,"",530,"","","","","","","","","","",null,"",null,"","","","","",null,"","","",null,"","","",null,"","","",""]
[null,null,"",531,"","","","","","","","","","",null,"",null,"","","","","",null,"","","",null,"","","",null,"","","",""]
[null,null,"",532,"","","","","","","","","","",null,"",null,"","","","","",null,"","","",null,"","","",null,"","","",""]
[null,null,"",533,"","","","","","","","","","",null,"",null,"","","","","",null,"","","",null,"","","",null,"","","",""]
[null,null,"",534,"","","","","","","","","","",null,"",null,"","","","","",null,"","","",null,"","","",null,"","","",""]
[null,null,"",535,"","","","","","","","","","",null,"",null,"","","","","",null,"","","",null,"","","",null,"","","",""]
[null,null,"",536,"","","","","","","","","","",null,"",null,"","","","","",null,"","","",null,"","","",null,"","","",""]
[null,null,{"$f":"IF(ISNUMBER(E542),C541+1,\"\")","v":""},537,"","","","","","","","","","",null,{"$f":"OFFSET(I542,0,P$5)","v":""},null,"","","","","",null,"","","",null,"","","",null,"","","",""]
[null,null,"",538,"","","","","","","","","","",null,"",null,"","","","","",null,{"$f":"IF(ISNUMBER($P543),($P543+X$5*$AM$2+$Y$4)/ABS(X$5),\"\")","v":""},"","",null,{"$f":"IF(ISNUMBER($P543),($P543+AB$5*$AM$2+$AC$4)/ABS(AB$5),\"\")","v":""},"","",null,{"$f":"IF(ISNUMBER($P543),($P543+AF$5*$AM$2+$AG$4)/ABS(AF$5),\"\")","v":""},"","",""]
[null,null,"",539,"","","","","","","","","","",null,"",null,"","","","","",null,"","","",null,"","","",null,"","","",""]
[null,null,"",540,"","","","","","","","","","",null,"",null,"","","","","",null,"","","",null,"","","",null,"","","",""]
[null,null,"",541,"","","","","","","","","","",null,"",null,"","","","","",null,"","","",null,"","","",null,"","","",""]
[null,null,"",542,"","","","","","","","","","",null,"",null,"","","","","",null,"","","",null,"","","",null,"","","",""]
[null,null,"",543,"","","","","","","","","","",null,"",null,"","","","","",null,"","","",null,"","","",null,"","","",""]
[null,null,"",544,"","","","","","","","","","",null,"",null,"","","","","",null,"","","",null,"","","",null,"","","",""]
[null,null,"",545,"","","","","","","","","","",null,"",null,"","","","","",null,"","","",null,"","","",null,"","","",""]
[null,null,"",546,"","","","","","","","","","",null,"",null,"","","","","",null,"","","",null,"","","",null,"","","",""]
[null,null,"",547,"","","","","","","","","","",null,"",null,"","","","","",null,"","","",null,"","","",null,"","","",""]
[null,null,"",548,"","","","","","","","","","",null,"",null,"","","","","",null,"","","",null,"","","",null,"","","",""]
[null,null,"",549,"","","","","","","","","","",null,"",null,"","","","","",null,"","","",null,"","","",null,"","","",""]
[null,null,"",550,"","","","","","","","","","",null,"",null,"","","","","",null,"","","",null,"","","",null,"","","",""]
[null,null,"",551,"","","","","","","","","","",null,"",null,{"$f":"IF(ISNUMBER($P556),($P556+R$5*$AM$2)/ABS(R$5),\"\")","v":""},"","","","",null,"","","",null,"","","",null,"","","",""]
[null,null,"",552,"","","","","","","","","","",null,"",null,"","","","","",null,"","","",null,"","","",null,"","","",""]
[null,null,"",553,"","","","","","","","","","",null,"",null,"","","","","",null,"","","",null,"","","",null,"","","",""]
[null,null,"",554,"","","","","","","","","","",null,"",null,"","","","","",null,"","","",null,"","","",null,"","","",""]
[null,null,"",555,"","","","","","","","","","",null,"",null,"","","","","",null,"","","",null,"","","",null,"","","",""]
[null,null,"",556,"","","","","","","","","","",null,"",null,"","","","","",null,"","","",null,"","","",null,"","","",""]
[null,null,"",557,"","","","","","","","","","",null,"",null,"","","","","",null,"","","",null,"","","",null,"","","",""]
[null,null,"",558,"","","","","","","","","","",null,"",null,"","","","","",null,"","","",null,"","","",null,"","","",""]
[null,null,"",559,"","","","","","","","","","",null,"",null,"","","","","",null,"","","",null,"","","",null,"","","",""]
[null,null,"",560,"","","","","","","","","","",null,"",null,"","","","","",null,"","","",null,"","","",null,"","","",""]
[null,null,"",561,"","","","","","","","","","",null,"",null,"","","","","",null,"","","",null,"","","",null,"","","",""]
[null,null,"",562,"","","","","","","","","","",null,"",null,"","","","","",null,"","","",null,"","","",null,"","","",""]
[null,null,"",563,"","","","","","","","","","",null,"",null,"","","","","",null,"","","",null,"","","",null,"","","",""]
[null,null,"",564,"","","","","","","","","","",null,"",null,"","","","","",null,"","","",null,"","","",null,"","","",""]
[null,null,"",565,"","","","","","","","","","",null,"",null,"","","","","",null,"","","",null,"","","",null,"","","",""]
[null,null,"",566,"","","","","","","","","","",null,"",null,"","","","","",null,"","","",null,"","","",null,"","","",""]
[null,null,"",567,"","","","","","","","","","",null,"",null,"","","","","",null,"","","",null,"","","",null,"","","",""]
[null,null,"",568,"","","","","","","","","","",null,"",null,"","","","","",null,"","","",null,"","","",null,"","","",""]
[null,null,"",569,"","","","","","","","","","",null,"",null,"","","","","",null,"","","",null,"","","",null,"","","",""]
[null,null,"",570,"","","","","","","","","","",null,"",null,"","","","","",null,"","","",null,"","","",null,"","","",""]
[null,null,"",571,"","","","","","","","","","",null,"",null,"","","","","",null,"","","",null,"","","",null,"","","",""]
[null,null,"",572,"","","","","","","","","","",null,"",null,"","","","","",null,"","","",null,"","","",null,"","","",""]
[null,null,"",573,"","","","","","","","","","",null,"",null,"","","","","",null,"","","",null,"","","",null,"","","",""]
[null,null,"",574,"","","","","","","","","","",null,"",null,"","","","","",null,"","","",null,"","","",null,"","","",""]
[null,null,"",575,"","","","","","","","","","",null,"",null,"","","","","",null,"","","",null,"","","",null,"","","",""]
[null,null,"",576,"","","","","","","","","","",null,"",null,"","","","","",null,"","","",null,"","","",null,"","","",""]
[null,null,"",577,{"$f":"IF(ISNUMBER(MATCH(D582,INDIRECT($A$7&\"!\"&$E$4&\"$7:\"&$E$4&\"$651\"),0)),MATCH(D582,INDIRECT($A$7&\"!\"&$E$4&\"$7:\"&$E$4&\"$651\"),0),\"\")","v":""},{"$f":"IF(ISNUMBER($E582),INDEX(INDIRECT($A$7&\"!h$7:h$651\"),$E582,1),\"\")","v":""},{"$f":"IF(ISNUMBER($E582),$F582&\" : \"&INDEX(INDIRECT($A$7&\"!i$7:i$651\"),$E582,1),\"\")","v":""},"",{"$f":"IF(ISNUMBER($E582),INDEX(INDIRECT($A$7&\"!k$7:k$651\"),$E582,1),\"\")","v":""},{"$f":"IF(ISNUMBER($E582),INDEX(INDIRECT($A$7&\"!l$7:l$651\"),$E582,1),\"\")","v":""},{"$f":"IF(ISNUMBER($E582),INDEX(INDIRECT($A$7&\"!m$7:m$651\"),$E582,1),\"\")","v":""},{"$f":"IF(ISNUMBER($E582),INDEX(INDIRECT($A$7&\"!n$7:n$651\"),$E582,1),\"\")","v":""},{"$f":"IF(ISNUMBER($E582),INDEX(INDIRECT($A$7&\"!o$7:o$651\"),$E582,1),\"\")","v":""},{"$f":"IF(ISNUMBER($E582),INDEX(INDIRECT($A$7&\"!p$7:p$651\"),$E582,1),\"\")","v":""},null,"",null,"","","","","",null,"","","",null,"","","",null,"","","",""]
[null,null,"",578,"","","",{"$f":"IF(ISNUMBER($E583),INDEX(INDIRECT($A$7&\"!DC$7:DC$651\"),$E583,1),\"\")","v":""},"","","","","","",null,"",null,"","","","","",null,"","","",null,"","","",null,"","","",{"$f":"IF(ISNUMBER($E583),INDEX(INDIRECT($A$7&\"!CZ$7:CZ$651\"),$E583,1),\"\")","v":""}]
[null,null,"",579,"","","","","","","","","","",null,"",null,"","","","","",null,"","","",null,"","","",null,"","","",""]
[null,null,"",580,"","","","","","","","","","",null,"",null,"","","","","",null,"","","",null,"","","",null,"","","",""]
[null,null,"",581,"","","","","","","","","","",null,"",null,"","","","","",null,"","","",null,"","","",null,"","","",""]
[null,null,"",582,"","","","","","","","","","",null,"",null,"","","","","",null,"","","",null,"","","",null,"","","",""]
[null,null,"",583,"","","","","","","","","","",null,"",null,"","","","","",null,"","","",null,"","","",null,"","","",""]
[null,null,"",584,"","","","","","","","","","",null,"",null,"","","","","",null,"","","",null,"","","",null,"","","",""]
[null,null,"",585,"","","","","","","","","","",null,"",null,"","","","","",null,"","","",null,"","","",null,"","","",""]
[null,null,"",586,"","","","","","","","","","",null,"",null,"","","","","",null,"","","",null,"","","",null,"","","",""]
[null,null,"",587,"","","","","","","","","","",null,"",null,"","","","","",null,"","","",null,"","","",null,"","","",""]
[null,null,"",588,"","","","","","","","","","",null,"",null,"","","","","",null,"","","",null,"","","",null,"","","",""]
[null,null,"",589,"","","","","","","","","","",null,"",null,"","","","","",null,"","","",null,"","","",null,"","","",""]
[null,null,"",590,"","","","","","","","","","",null,"",null,"","","","","",null,"","","",null,"","","",null,"","","",""]
[null,null,"",591,"","","","","","","","","","",null,"",null,"","","","","",null,"","","",null,"","","",null,"","","",""]
[null,null,"",592,"","","","","","","","","","",null,"",null,"","","","","",null,"","","",null,"","","",null,"","","",""]
[null,null,"",593,"","","","","","","","","","",null,"",null,"","","","","",null,"","","",null,"","","",null,"","","",""]
[null,null,"",594,"","","","","","","","","","",null,"",null,"","","","","",null,"","","",null,"","","",null,"","","",""]
[null,null,"",595,"","","","","","","","","","",null,"",null,"","","","","",null,"","","",null,"","","",null,"","","",""]
[null,null,"",596,"","","","","","","","","","",null,"",null,"","","","","",null,"","","",null,"","","",null,"","","",""]
[null,null,"",597,"","","","","","","","","","",null,"",null,"","","","","",null,"","","",null,"","","",null,"","","",""]
[null,null,"",598,"","","","","","","","","","",null,"",null,"","","","","",null,"","","",null,"","","",null,"","","",""]
[null,null,"",599,"","","","","","","","","","",null,"",null,"","","","","",null,"","","",null,"","","",null,"","","",""]
[null,null,"",600,"","","","","","","","","","",null,"",null,"","","","","",null,"","","",null,"","","",null,"","","",""]
[null,null,{"$f":"IF(ISNUMBER(E606),C605+1,\"\")","v":""},601,"","","","","","","","","","",null,{"$f":"OFFSET(I606,0,P$5)","v":""},null,"","","","","",null,"","","",null,"","","",null,"","","",""]
[null,null,"",602,"","","","","","","","","","",null,"",null,{"$f":"IF(ISNUMBER($P607),($P607+R$5*$AM$2)/ABS(R$5),\"\")","v":""},"","","","",null,{"$f":"IF(ISNUMBER($P607),($P607+X$5*$AM$2+$Y$4)/ABS(X$5),\"\")","v":""},"","",null,{"$f":"IF(ISNUMBER($P607),($P607+AB$5*$AM$2+$AC$4)/ABS(AB$5),\"\")","v":""},"","",null,{"$f":"IF(ISNUMBER($P607),($P607+AF$5*$AM$2+$AG$4)/ABS(AF$5),\"\")","v":""},"","",""]
[null,null,"",603,"","","","","","","","","","",null,"",null,"","","","","",null,"","","",null,"","","",null,"","","",""]
[null,null,"",604,"","","","","","","","","","",null,"",null,"","","","","",null,"","","",null,"","","",null,"","","",""]
[null,null,"",605,"","","","","","","","","","",null,"",null,"","","","","",null,"","","",null,"","","",null,"","","",""]
[null,null,"",606,"","","","","","","","","","",null,"",null,"","","","","",null,"","","",null,"","","",null,"","","",""]
[null,null,"",607,"","","","","","","","","","",null,"",null,"","","","","",null,"","","",null,"","","",null,"","","",""]
[null,null,"",608,"","","","","","","","","","",null,"",null,"","","","","",null,"","","",null,"","","",null,"","","",""]
[null,null,"",609,"","","","","","","","","","",null,"",null,"","","","","",null,"","","",null,"","","",null,"","","",""]
[null,null,"",610,"","","","","","","","","","",null,"",null,"","","","","",null,"","","",null,"","","",null,"","","",""]
[null,null,"",611,"","","","","","","","","","",null,"",null,"","","","","",null,"","","",null,"","","",null,"","","",""]
[null,null,"",612,"","","","","","","","","","",null,"",null,"","","","","",null,"","","",null,"","","",null,"","","",""]
[null,null,"",613,"","","","","","","","","","",null,"",null,"","","","","",null,"","","",null,"","","",null,"","","",""]
[null,null,"",614,"","","","","","","","","","",null,"",null,"","","","","",null,"","","",null,"","","",null,"","","",""]
[null,null,"",615,"","","","","","","","","","",null,"",null,"","","","","",null,"","","",null,"","","",null,"","","",""]
[null,null,"",616,"","","","","","","","","","",null,"",null,"","","","","",null,"","","",null,"","","",null,"","","",""]
[null,null,"",617,"","","","","","","","","","",null,"",null,"","","","","",null,"","","",null,"","","",null,"","","",""]
[null,null,"",618,"","","","","","","","","","",null,"",null,"","","","","",null,"","","",null,"","","",null,"","","",""]
[null,null,"",619,"","","","","","","","","","",null,"",null,"","","","","",null,"","","",null,"","","",null,"","","",""]
[null,null,"",620,"","","","","","","","","","",null,"",null,"","","","","",null,"","","",null,"","","",null,"","","",""]
[null,null,"",621,"","","","","","","","","","",null,"",null,"","","","","",null,"","","",null,"","","",null,"","","",""]
[null,null,"",622,"","","","","","","","","","",null,"",null,"","","","","",null,"","","",null,"","","",null,"","","",""]
[null,null,"",623,"","","","","","","","","","",null,"",null,"","","","","",null,"","","",null,"","","",null,"","","",""]
[null,null,"",624,"","","","","","","","","","",null,"",null,"","","","","",null,"","","",null,"","","",null,"","","",""]
[null,null,"",625,"","","","","","","","","","",null,"",null,"","","","","",null,"","","",null,"","","",null,"","","",""]
[null,null,"",626,"","","","","","","","","","",null,"",null,"","","","","",null,"","","",null,"","","",null,"","","",""]
[null,null,"",627,"","","","","","","","","","",null,"",null,"","","","","",null,"","","",null,"","","",null,"","","",""]
[null,null,"",628,"","","","","","","","","","",null,"",null,"","","","","",null,"","","",null,"","","",null,"","","",""]
[null,null,"",629,"","","","","","","","","","",null,"",null,"","","","","",null,"","","",null,"","","",null,"","","",""]
[null,null,"",630,"","","","","","","","","","",null,"",null,"","","","","",null,"","","",null,"","","",null,"","","",""]
[null,null,"",631,"","","","","","","","","","",null,"",null,"","","","","",null,"","","",null,"","","",null,"","","",""]
[null,null,"",632,"","","","","","","","","","",null,"",null,"","","","","",null,"","","",null,"","","",null,"","","",""]
[null,null,"",633,"","","","","","","","","","",null,"",null,"","","","","",null,"","","",null,"","","",null,"","","",""]
[null,null,"",634,"","","","","","","","","","",null,"",null,"","","","","",null,"","","",null,"","","",null,"","","",""]
[null,null,"",635,"","","","","","","","","","",null,"",null,"","","","","",null,"","","",null,"","","",null,"","","",""]
[null,null,"",636,"","","","","","","","","","",null,"",null,"","","","","",null,"","","",null,"","","",null,"","","",""]
[null,null,"",637,"","","","","","","","","","",null,"",null,"","","","","",null,"","","",null,"","","",null,"","","",""]
[null,null,"",638,"","","","","","","","","","",null,"",null,"","","","","",null,"","","",null,"","","",null,"","","",""]
[null,null,"",639,"","","","","","","","","","",null,"",null,"","","","","",null,"","","",null,"","","",null,"","","",""]
[null,null,"",640,"","","","","","","","","","",null,"",null,"","","","","",null,"","","",null,"","","",null,"","","",""]
[null,null,"",641,{"$f":"IF(ISNUMBER(MATCH(D646,INDIRECT($A$7&\"!\"&$E$4&\"$7:\"&$E$4&\"$651\"),0)),MATCH(D646,INDIRECT($A$7&\"!\"&$E$4&\"$7:\"&$E$4&\"$651\"),0),\"\")","v":""},"","","","","","","","","",null,"",null,"","","","","",null,"","","",null,"","","",null,"","","",""]
[null,null,"",642,{"$f":"IF(ISNUMBER(MATCH(D647,INDIRECT($A$7&\"!\"&$E$4&\"$7:\"&$E$4&\"$651\"),0)),MATCH(D647,INDIRECT($A$7&\"!\"&$E$4&\"$7:\"&$E$4&\"$651\"),0),\"\")","v":""},"","",{"$f":"IF(ISNUMBER($E647),INDEX(INDIRECT($A$7&\"!DC$7:DC$651\"),$E647,1),\"\")","v":""},"","","","","","",null,"",null,"","","","","",null,"","","",null,"","","",null,"","","",{"$f":"IF(ISNUMBER($E647),INDEX(INDIRECT($A$7&\"!CZ$7:CZ$651\"),$E647,1),\"\")","v":""}]
[null,null,"",643,{"$f":"IF(ISNUMBER(MATCH(D648,INDIRECT($A$7&\"!\"&$E$4&\"$7:\"&$E$4&\"$651\"),0)),MATCH(D648,INDIRECT($A$7&\"!\"&$E$4&\"$7:\"&$E$4&\"$651\"),0),\"\")","v":""},"","","","","","","","","",null,"",null,"","","","","",null,"","","",null,"","","",null,"","","",""]
[null,null,"",644,{"$f":"IF(ISNUMBER(MATCH(D649,INDIRECT($A$7&\"!\"&$E$4&\"$7:\"&$E$4&\"$651\"),0)),MATCH(D649,INDIRECT($A$7&\"!\"&$E$4&\"$7:\"&$E$4&\"$651\"),0),\"\")","v":""},"","","","","","","","","",null,"",null,"","","","","",null,"","","",null,"","","",null,"","","",""]
[null,null,"",645,{"$f":"IF(ISNUMBER(MATCH(D650,INDIRECT($A$7&\"!\"&$E$4&\"$7:\"&$E$4&\"$651\"),0)),MATCH(D650,INDIRECT($A$7&\"!\"&$E$4&\"$7:\"&$E$4&\"$651\"),0),\"\")","v":""},"","","","","","","","","",null,"",null,"","","","","",null,"","","",null,"","","",null,"","","",""]

{"sheet":"1","index":1,"n_rows":651,"n_cols":116,"rows_kept":651,"cut":false,"hidden":false,"merged":[]}
[{"$f":"RIGHT(CELL(\"filename\",A1),LEN(CELL(\"filename\",A1))-FIND(\"]\",CELL(\"filename\",A1)))&\"r\"","v":"1r"},"5'","3'","TA","処理",null,null,null,{"$f":"INDIRECT(A1&\"!G1\")","v":">test"}]
[null,{"$f":"INDIRECT(A1&\"!B1\")","v":"p-"},{"$f":"INDIRECT(A1&\"!B2\")","v":"-OH"},{"$f":"INDIRECT(A1&\"!B19\")","v":"-OH"},null,null,null,null,{"$f":"SUBSTITUTE(UPPER(SUBSTITUTE(INDIRECT(A1&\"!G2\"),\" \",\"\")),\"T\",INDIRECT(A1&\"!B10\"))","v":"UGCCUQUC/CGCA"},null,{"$f":"SUBSTITUTE(UPPER(SUBSTITUTE(INDIRECT(A1&\"!I2\"),\" \",\"\")),\"T\",INDIRECT(A1&\"!B10\"))","v":""}]
[null,{"$f":"INDIRECT(A1&\"!B42\")","v":"p-"},{"$f":"IF(C2=\"-p\",0,-1)","v":-1},{"$f":"IF(D2=\"-p\",0,-1)","v":-1},null,null,null,null,{"$f":"LEN($I$2)","v":13},null,null,null,null,null,null,null,null,null,null,null,null,null,null,null,null,null,null,null,null,null,null,null,null,null,null,null,null,null,null,null,null,null,null,null,null,null,null,null,null,null,null,null,null,null,null,null,null,null,null,null,null,null,null,null,null,null,null,null,null,null,null,null,null,null,null,null,null,null,null,"ユーザー用塩基",null,null,null,null,null,null,null,null,null,null,null,null,null,null,null,null,null,null,null,"HPO3"]
[null,null,null,null,null,null,"1=末端、2=3'ラダー",null,null,null,null,null,null,null,"topの適当な予想値",null,null,"小さい順","小さい順重複","同点","大きい順","長さ","C","U","T","A","G","^",":","#","°","~",")","\\","J","B","=","/","\"","+","*","`","'",",","|","{","[","]",">","?","%","$","!",1,2,3,4,5,6,7,8,9,"D","E","F","I","K","L","M","O","P","Q","R","S","V","W","X","Y","Z","N","}","&","@","H","(","À","Á","Â","Ã","Ä","Å","Æ","∝","Ç","◊","Ò","Õ","Ï","Ñ","-p",">p","H2O","CH2","修飾の数","5'","3'","fragment","cap m7G","5'末端","p","Me","m7G","H2O",null,"ave","mono"]
[null,"p個数",null,null,null,"1=Rnase",null,"position","position","fragment","ave","ave>p","mono","mono>p","top","top>p",null,null,null,null,null,null,243.21662000000003,244.20138,258.22796,267.24131999999997,283.24072000000001,479.33584200000007,281.2679,297.26730000000003,285.25330000000002,315.27927999999997,345.30525999999998,272.25454000000002,258.22796,257.2432,281.2679,281.2679,281.2679,335.35834,381.44991999999996,351.35774000000004,257.2432,332.26343999999995,325.32045999999997,287.26918000000001,458.44628,258.22796,271.22672,257.2432,259.28222000000005,347.34427999999997,331.27868000000001,316.26403999999997,260.26697999999999,332.32963999999998,260.26697999999999,274.22735999999998,412.35470000000004,297.26730000000003,571.53441999999995,571.53441999999995,246.21725999999998,426.38128,274.29356000000001,268.22608000000002,297.26730000000003,297.26730000000003,285.25330000000002,282.25266000000005,244.20138,409.39382000000001,311.29388,303.33478000000002,318.23685999999998,540.48062000000004,345.30525999999998,508.48181999999997,258.22796,{"$f":"INDIRECT(A1&\"!B12\")","v":273.24259999999998},371.38890000000004,301.2527,381.35895999999997,397.42455999999999,324.29264000000001,335.31528000000003,349.34186000000005,295.29448000000002,359.33184,273.24259999999998,287.26918000000001,341.36292000000003,260.20078000000001,192.16988000000001,302.23746,271.26978000000003,258.22796,394.33942000000002,287.22612000000004,79.979901999999996,61.964621999999991,18.015280000000001,14.026579999999999,null,null,null,null,null,"-OH",0,0,0,0]
[null,"5-p","3-p","H2O","CH2","5end","3end",0,null,null,null,null,null,null,null,null,null,{"$f":"MAX(R7:R500)","v":3},null,null,null,null,243.08552054839998,244.06953613140001,258.08518619519998,267.09675394089999,283.09166856320002,479.10534307410001,281.11240400470001,297.10731862699998,285.09608523449998,315.10664992059998,345.11721460669997,272.100836259,258.08518619519998,257.10117061220001,281.11240400470001,281.11240400470001,281.11240400470001,335.15935419610003,381.14707498989998,351.1542688184,257.10117061220001,332.08558012589998,325.13861875459997,287.1117352983,458.12198245460002,258.08518619519998,271.08043517070001,257.10117061220001,259.0626766561,347.07872065059996,331.10156454290001,316.09066550360001,260.04669223909997,332.06782161129996,260.04669223909997,274.08010081750001,412.13426166080001,297.10731862699998,571.21257155730007,571.21257155730007,246.08518619519998,426.14991172460003,274.06234230289999,268.08076952390002,297.10731862699998,297.10731862699998,285.09608523449998,282.09641958769998,244.06953613140001,409.15974812679997,311.12296869080001,303.08889140599996,318.06993006209996,540.18160578289996,345.11721460669997,508.19177653829996,258.08518619519998,{"$f":"INDIRECT(A1&\"!B13\")","v":273.09608523449998},371.18048356829996,301.09099985680001,381.08419995899993,397.0613560667,324.11821766629998,335.12296869080001,349.13861875459997,295.12805406849998,359.1328646705,273.09608523449998,287.1117352983,341.16991888219997,260.06445075369999,192.07462150909998,302.07501543979998,271.11682067599997,258.08518619519998,394.12369697469995,287.07534979299999,79.966330388800003,61.955765702700006,18.0105646861,14.015650063799999,null,null,null,null,null,"p-",1,0,0,0,"HPO3",79.979901999999996,79.966330388800003]
[{"$f":"IF(V7=0,\"\",A6+1)","v":1},{"$f":"IF($F7=1,VLOOKUP($B$2,$DE$5:$DG$11,2,FALSE),IF($F7=2,VLOOKUP($B$3,$DE$5:$DG$6,2,FALSE),0))","v":1},{"$f":"IF($C$2=\"forced-OH\",-1,IF($G7=1,$C$3,IF($G7=2,$D$3,0)))","v":0},{"$f":"IF($F7=1,VLOOKUP($B$2,$DE$5:$DI$11,5,FALSE),0)","v":0},{"$f":"IF($F7=1,VLOOKUP($B$2,$DE$5:$DG$11,3,FALSE),0)","v":0},1,null,1,2,"UG",{"$f":"IF(V7=0,\"\",SUMPRODUCT(W$5:CY$5,W7:CY7))","v":749.36652600000002},{"$f":"IF(C7=-1,\"\",K7-18.01528)","v":731.35124600000006},{"$f":"IF(V7=0,\"\",SUMPRODUCT(W$6:CY$6,W7:CY7))","v":749.04963117490001},{"$f":"IF(C7=-1,\"\",M7-18.0105646861)","v":731.03906648880002},{"$f":"IF(V7=0,\"\",M7+TRUNC(K7-M7-0.1))","v":749.04963117490001},{"$f":"IF(C7=-1,\"\",O7-18.0105646861)","v":731.03906648880002},{"$f":"IF(V7>0,ROUND(K7,4),\"\")","v":749.36649999999997},{"$f":"IF(V7>0,S7+T7,\"\")","v":2},{"$f":"IF(V7>0,COUNTIF(Q$7:Q$651,\"<\"&Q7)+1,\"\")","v":2},{"$f":"IF(V7>0,COUNTIF(Q$7:Q7,\"=\"&Q7)-1,\"\")","v":0},{"$f":"IF(V7>0,$R$6-R7+1,\"\")","v":2},{"$f":"LEN(J7)","v":2},{"$f":"$V7-LEN(SUBSTITUTE($J7,W$4,\"\"))","v":0},1,0,0,1,{"$f":"IF($CZ7>0,$V7-LEN(SUBSTITUTE($J7,AB$4,\"\")),0)","v":0},0,0,0,0,0,0,0,0,0,{"$f":"IF($CZ7>0,$V7-LEN(SUBSTITUTE($J7,AL$4,\"\")),0)","v":0},0,0,0,0,0,0,0,0,0,{"$f":"IF($CZ7>0,$V7-LEN(SUBSTITUTE($J7,AV$4,\"\")),0)","v":0},0,0,0,0,0,0,0,0,0,0,0,{"$f":"IF($CZ7>0,$V7-LEN(SUBSTITUTE($J7,BH$4,\"\")),0)+DD7","v":0},{"$f":"IF($CZ7>0,$V7-LEN(SUBSTITUTE($J7,BI$4,\"\")),0)","v":0},0,0,0,0,0,0,0,0,0,{"$f":"IF($CZ7>0,$V7-LEN(SUBSTITUTE($J7,BS$4,\"\")),0)","v":0},0,0,0,0,0,0,0,0,0,{"$f":"IF($CZ7>0,$V7-LEN(SUBSTITUTE($J7,CC$4,\"\")),0)","v":0},0,0,0,0,0,0,0,0,0,0,{"$f":"IF($CZ7>0,$V7-LEN(SUBSTITUTE($J7,CN$4,\"\")),0)","v":0},0,0,0,{"$f":"IF($CZ7>0,$V7-LEN(SUBSTITUTE($J7,CR$4,\"\")),0)","v":0},0,0,0,{"$f":"V7+B7+C7","v":3},null,{"$f":"-(V7-1)+D7","v":-1},{"$f":"E7","v":0},{"$f":"$V7-$W7-$X7-$Z7-$AA7","v":0},{"$f":"IF($B7=0,\"\",IF(F7=1,LEFT($B$2,LEN($B$2)-1),LEFT($B$3,LEN($B$3)-1)))","v":"p"},{"$f":"IF($C7=0,\"p\",\"\")","v":"p"},{"$f":"DA7&J7&DB7","v":"pUGp"},{"$f":"IF($F7=1,VLOOKUP($B$2,$DE$5:$DH$11,4,FALSE),0)","v":0},"pp-",2,0,0,0,"H2P2O6"]
[2,{"$f":"IF($F8=1,VLOOKUP($B$2,$DE$5:$DG$11,2,FALSE),IF($F8=2,VLOOKUP($B$3,$DE$5:$DG$6,2,FALSE),0))","v":0},0,0,0,null,null,3,11,"CCUQUC/CG",3010.8685580000001,2992.853278,3009.4574311614997,2991.4468664753995,3010.4574311614997,2992.4468664753995,3010.8685999999998,3,3,{"$f":"IF(V8>0,COUNTIF(Q$7:Q8,\"=\"&Q8)-1,\"\")","v":0},1,9,4,2,0,0,1,0,0,0,0,0,0,0,0,0,0,1,0,0,0,0,0,0,0,0,0,0,0,0,0,0,0,0,0,0,0,0,0,0,0,0,0,0,0,0,0,0,0,0,0,1,0,0,0,0,0,0,0,0,0,0,0,0,0,0,0,0,0,0,0,0,0,0,0,0,0,0,0,9,null,-8,0,2,{"$f":"IF($B8=0,\"\",IF(F8=1,LEFT($B$2,LEN($B$2)-1),LEFT($B$3,LEN($B$3)-1)))","v":""},"p","CCUQUC/CGp",{"$f":"IF($F8=1,VLOOKUP($B$2,$DE$5:$DH$11,4,FALSE),0)","v":0},"ppp-",3,0,0,0,"H3P3O9",239.939706,239.89899116640001]
[3,0,-1,{"$f":"IF($F9=1,VLOOKUP($B$2,$DE$5:$DI$11,5,FALSE),0)","v":0},0,null,1,12,13,"CA",572.42256200000008,"",572.13804019199995,"",572.13804019199995,"",572.42259999999999,1,1,{"$f":"IF(V9>0,COUNTIF(Q$7:Q9,\"=\"&Q9)-1,\"\")","v":0},3,2,1,0,0,1,0,0,0,0,0,0,0,0,0,0,0,0,0,0,0,0,0,0,0,0,0,0,0,0,0,0,0,0,0,0,0,0,0,0,0,0,0,0,0,0,0,0,0,0,0,0,0,0,0,0,0,0,0,0,0,0,0,0,0,0,0,0,0,0,0,0,0,0,0,0,0,0,0,1,null,-1,0,0,"","","CA",0,"m-ppp-",3,1,0,0,"CH2+H3P3O9",253.966286,253.9146412302]
["",0,0,0,0,null,null,null,null,null,"",{"$error":"#VALUE!"},"",{"$error":"#VALUE!"},"",{"$error":"#VALUE!"},"","","",{"$f":"IF(V10>0,COUNTIF(Q$7:Q10,\"=\"&Q10)-1,\"\")","v":""},"",0,0,0,0,0,0,0,0,0,0,0,0,0,0,0,0,0,0,0,0,0,0,0,0,0,0,0,0,0,0,0,0,0,0,0,0,0,0,0,0,0,0,0,0,0,0,0,0,0,0,0,0,0,0,0,0,0,0,0,0,0,0,0,0,0,0,0,0,0,0,0,0,0,0,0,0,0,0,0,null,1,0,0,"","p","p",0,"m(3)Gppp-",3,2,1,-1,"m7G+H3P3O9-H2O+(CH2)*2",547.24488600000018,547.02704523490002]
["",0,0,0,0,null,null,null,null,null,"",{"$error":"#VALUE!"},"",{"$error":"#VALUE!"},"",{"$error":"#VALUE!"},"","","",{"$f":"IF(V11>0,COUNTIF(Q$7:Q11,\"=\"&Q11)-1,\"\")","v":""},"",0,0,0,0,0,0,0,0,0,0,0,0,0,0,0,0,0,0,0,0,0,0,0,0,0,0,0,0,0,0,0,0,0,0,0,0,0,0,0,0,0,0,0,0,0,0,0,0,0,0,0,0,0,0,0,0,0,0,0,0,0,0,0,0,0,0,0,0,0,0,0,0,0,0,0,0,0,0,0,null,1,0,0,"","p","p",0,"m(1)Gppp-",3,0,1,-1,"m7G+H3P3O9-H2O",519.19172600000013,518.99574510729997]
["",0,0,0,0,null,null,null,null,null,"",{"$error":"#VALUE!"},"",{"$error":"#VALUE!"},"",{"$error":"#VALUE!"},"","","",{"$f":"IF(V12>0,COUNTIF(Q$7:Q12,\"=\"&Q12)-1,\"\")","v":""},"",0,0,0,0,0,0,0,0,0,0,0,0,0,0,0,0,0,0,0,0,0,0,0,0,0,0,0,0,0,0,0,0,0,0,0,0,0,0,0,0,0,0,{"$f":"IF($CZ12>0,$V12-LEN(SUBSTITUTE($J12,BL$4,\"\")),0)","v":0},0,0,0,0,0,0,0,0,0,0,0,0,0,0,0,0,0,0,0,0,0,0,0,0,0,0,0,0,0,0,0,0,0,0,0,0,null,1,0,0,"","p","p",0]
["",0,0,0,0,null,null,null,null,null,"",{"$error":"#VALUE!"},"",{"$error":"#VALUE!"},"",{"$error":"#VALUE!"},"","","",{"$f":"IF(V13>0,COUNTIF(Q$7:Q13,\"=\"&Q13)-1,\"\")","v":""},"",0,0,0,0,0,0,0,0,0,0,0,0,0,0,0,0,0,0,0,0,0,0,0,0,0,0,0,0,0,0,0,0,0,0,0,0,0,0,0,0,0,0,0,0,0,0,0,0,0,0,0,0,0,0,0,0,0,0,0,0,0,0,0,0,0,0,0,0,0,0,0,0,0,0,0,0,0,0,0,null,1,0,0,"","p","p",0]
["",0,0,0,0,null,null,null,null,null,"",{"$error":"#VALUE!"},"",{"$error":"#VALUE!"},"",{"$error":"#VALUE!"},"","","",{"$f":"IF(V14>0,COUNTIF(Q$7:Q14,\"=\"&Q14)-1,\"\")","v":""},"",0,0,0,0,0,0,0,0,0,0,0,0,0,0,0,0,0,0,0,0,0,0,0,0,0,0,0,0,0,0,0,0,0,0,0,0,0,0,0,0,0,0,0,0,0,0,0,0,0,0,0,0,0,0,0,0,0,0,0,0,0,0,0,0,0,0,0,0,0,0,0,0,0,0,0,0,0,0,0,null,1,0,0,"","p","p",0]
["",0,0,0,0,null,null,null,null,null,"",{"$error":"#VALUE!"},"",{"$error":"#VALUE!"},"",{"$error":"#VALUE!"},"","","",{"$f":"IF(V15>0,COUNTIF(Q$7:Q15,\"=\"&Q15)-1,\"\")","v":""},"",0,0,0,0,0,0,0,0,0,0,0,0,0,0,0,0,0,0,0,0,0,0,0,0,0,0,0,0,0,0,0,0,0,0,0,0,0,0,0,0,0,0,0,0,0,0,0,0,0,0,0,0,0,0,0,0,0,0,0,0,0,0,0,0,0,0,0,0,0,0,0,0,0,0,0,0,0,0,0,null,1,0,0,"","p","p",0]
["",0,0,0,0,null,null,null,null,null,"",{"$error":"#VALUE!"},"",{"$error":"#VALUE!"},"",{"$error":"#VALUE!"},"","","",{"$f":"IF(V16>0,COUNTIF(Q$7:Q16,\"=\"&Q16)-1,\"\")","v":""},"",0,0,0,0,0,0,0,0,0,0,0,0,0,0,0,0,0,0,0,0,0,0,0,0,0,0,0,0,0,0,0,0,0,0,0,0,0,0,0,0,0,0,0,0,0,0,0,0,0,0,0,0,0,0,0,0,0,0,0,0,0,0,0,0,0,0,0,0,0,0,0,0,0,0,0,0,0,0,0,null,1,0,0,"","p","p",0]
["",0,0,0,0,null,null,null,null,null,"",{"$error":"#VALUE!"},"",{"$error":"#VALUE!"},"",{"$error":"#VALUE!"},"","","",{"$f":"IF(V17>0,COUNTIF(Q$7:Q17,\"=\"&Q17)-1,\"\")","v":""},"",0,{"$f":"$V17-LEN(SUBSTITUTE($J17,W$4,\"\"))","v":0},0,0,0,0,{"$f":"IF($CZ17>0,$V17-LEN(SUBSTITUTE($J17,AB$4,\"\")),0)","v":0},0,0,0,0,0,0,0,0,0,{"$f":"IF($CZ17>0,$V17-LEN(SUBSTITUTE($J17,AL$4,\"\")),0)","v":0},0,0,0,0,0,0,0,0,0,{"$f":"IF($CZ17>0,$V17-LEN(SUBSTITUTE($J17,AV$4,\"\")),0)","v":0},0,0,0,0,0,0,0,0,0,0,0,0,{"$f":"IF($CZ17>0,$V17-LEN(SUBSTITUTE($J17,BI$4,\"\")),0)","v":0},0,0,0,0,0,0,0,0,0,{"$f":"IF($CZ17>0,$V17-LEN(SUBSTITUTE($J17,BS$4,\"\")),0)","v":0},0,0,0,0,0,0,0,0,0,{"$f":"IF($CZ17>0,$V17-LEN(SUBSTITUTE($J17,CC$4,\"\")),0)","v":0},0,0,0,0,0,0,0,0,0,0,0,0,0,0,0,0,0,0,0,null,1,0,0,"","p","p",0]
["",0,0,0,0,null,null,null,null,null,"",{"$error":"#VALUE!"},"",{"$error":"#VALUE!"},"",{"$error":"#VALUE!"},"","","",{"$f":"IF(V18>0,COUNTIF(Q$7:Q18,\"=\"&Q18)-1,\"\")","v":""},"",0,0,0,0,0,0,0,0,0,0,0,0,0,0,0,0,0,0,0,0,0,0,0,0,0,0,0,0,0,0,0,0,0,0,0,0,0,0,0,0,0,0,0,0,0,0,0,0,0,0,0,0,0,0,0,0,0,0,0,0,0,0,0,0,0,0,0,0,0,0,0,0,0,0,0,0,0,0,0,null,1,0,0,"","p","p",0]
["",0,0,0,0,null,null,null,null,null,"",{"$error":"#VALUE!"},"",{"$error":"#VALUE!"},"",{"$error":"#VALUE!"},"","","",{"$f":"IF(V19>0,COUNTIF(Q$7:Q19,\"=\"&Q19)-1,\"\")","v":""},"",0,0,0,0,0,0,0,0,0,0,0,0,0,0,0,0,0,0,0,0,0,0,0,0,0,0,0,0,0,0,0,0,0,0,0,0,0,0,0,0,0,0,0,0,0,0,0,0,0,0,0,0,0,0,0,0,0,0,0,0,0,0,0,0,0,0,0,0,0,0,0,0,0,0,0,0,0,0,0,null,1,0,0,"","p","p",0]
["",0,0,0,0,null,null,null,null,null,"",{"$error":"#VALUE!"},"",{"$error":"#VALUE!"},"",{"$error":"#VALUE!"},"","","",{"$f":"IF(V20>0,COUNTIF(Q$7:Q20,\"=\"&Q20)-1,\"\")","v":""},"",0,0,0,0,0,0,0,0,0,0,0,0,0,0,0,0,0,0,0,0,0,0,0,0,0,0,0,0,0,0,0,0,0,0,0,0,0,0,0,0,0,0,0,0,0,0,0,0,0,0,0,0,0,0,0,0,0,0,0,0,0,0,0,0,0,0,0,0,0,0,0,0,0,0,0,0,0,0,0,null,1,0,0,"","p","p",0]
["",0,0,0,0,null,null,null,null,null,"",{"$error":"#VALUE!"},"",{"$error":"#VALUE!"},"",{"$error":"#VALUE!"},"","","",{"$f":"IF(V21>0,COUNTIF(Q$7:Q21,\"=\"&Q21)-1,\"\")","v":""},"",0,0,0,0,0,0,0,0,0,0,0,0,0,0,0,0,0,0,0,0,0,0,0,0,0,0,0,0,0,0,0,0,0,0,0,0,0,0,0,0,0,0,0,0,0,0,0,0,0,0,0,0,0,0,0,0,0,0,0,0,0,0,0,0,0,0,0,0,0,0,0,0,0,0,0,0,0,0,0,null,1,0,0,"","p","p",0]
["",0,0,0,0,null,null,null,null,null,"",{"$error":"#VALUE!"},"",{"$error":"#VALUE!"},"",{"$error":"#VALUE!"},"","","",{"$f":"IF(V22>0,COUNTIF(Q$7:Q22,\"=\"&Q22)-1,\"\")","v":""},"",0,0,0,0,0,0,0,0,0,0,0,0,0,0,0,0,0,0,0,0,0,0,0,0,0,0,0,0,0,0,0,0,0,0,0,0,0,0,0,0,0,0,0,0,0,0,0,0,0,0,0,0,0,0,0,0,0,0,0,0,0,0,0,0,0,0,0,0,0,0,0,0,0,0,0,0,0,0,0,null,1,0,0,"","p","p",0]
["",0,0,0,0,null,null,null,null,null,"",{"$error":"#VALUE!"},"",{"$error":"#VALUE!"},"",{"$error":"#VALUE!"},"","","",{"$f":"IF(V23>0,COUNTIF(Q$7:Q23,\"=\"&Q23)-1,\"\")","v":""},"",0,0,0,0,0,0,0,0,0,0,0,0,0,0,0,0,0,0,0,0,0,0,0,0,0,0,0,0,0,0,0,0,0,0,0,0,0,0,0,0,0,0,0,0,0,0,0,0,0,0,0,0,0,0,0,0,0,0,0,0,0,0,0,0,0,0,0,0,0,0,0,0,0,0,{"$f":"IF($CZ23>0,$V23-LEN(SUBSTITUTE($J23,CR$4,\"\")),0)","v":0},0,0,0,0,null,1,0,0,"","p","p",0]
["",0,0,0,0,null,null,null,null,null,"",{"$error":"#VALUE!"},"",{"$error":"#VALUE!"},"",{"$error":"#VALUE!"},"","","",{"$f":"IF(V24>0,COUNTIF(Q$7:Q24,\"=\"&Q24)-1,\"\")","v":""},"",0,0,0,0,0,0,0,0,0,0,0,0,0,0,0,0,0,0,0,0,0,0,0,0,0,0,0,0,0,0,0,0,0,0,0,0,0,0,0,0,0,0,0,0,0,0,0,0,0,0,0,0,0,0,0,0,0,0,0,0,0,0,0,0,0,0,0,0,0,0,0,0,0,0,0,0,0,0,0,null,1,0,0,"","p","p",0]
["",0,0,0,0,null,null,null,null,null,"",{"$error":"#VALUE!"},"",{"$error":"#VALUE!"},"",{"$error":"#VALUE!"},"","","",{"$f":"IF(V25>0,COUNTIF(Q$7:Q25,\"=\"&Q25)-1,\"\")","v":""},"",0,0,0,0,0,0,0,0,0,0,0,0,0,0,0,0,0,0,0,0,0,0,0,0,0,0,0,0,0,0,0,0,0,0,0,0,0,0,0,0,0,0,0,0,0,0,0,0,0,0,0,0,0,0,0,0,0,0,0,0,0,0,0,0,0,0,0,0,0,0,0,0,0,0,0,0,0,0,0,null,1,0,0,"","p","p",0]
["",0,0,0,0,null,null,null,null,null,"",{"$error":"#VALUE!"},"",{"$error":"#VALUE!"},"",{"$error":"#VALUE!"},"","","",{"$f":"IF(V26>0,COUNTIF(Q$7:Q26,\"=\"&Q26)-1,\"\")","v":""},"",0,0,0,0,0,0,0,0,0,0,0,0,0,0,0,0,0,0,0,0,0,0,0,0,0,0,0,0,0,0,0,0,0,0,0,0,0,0,0,0,0,0,0,0,0,0,0,0,0,0,0,0,0,0,0,0,0,0,0,0,0,0,0,0,0,0,0,0,0,0,0,0,0,0,0,0,0,0,0,null,1,0,0,"","p","p",0]
["",0,0,0,0,null,null,null,null,null,"",{"$error":"#VALUE!"},"",{"$error":"#VALUE!"},"",{"$error":"#VALUE!"},"","","",{"$f":"IF(V27>0,COUNTIF(Q$7:Q27,\"=\"&Q27)-1,\"\")","v":""},"",0,{"$f":"$V27-LEN(SUBSTITUTE($J27,W$4,\"\"))","v":0},0,0,0,0,{"$f":"IF($CZ27>0,$V27-LEN(SUBSTITUTE($J27,AB$4,\"\")),0)","v":0},0,0,0,0,0,0,0,0,0,{"$f":"IF($CZ27>0,$V27-LEN(SUBSTITUTE($J27,AL$4,\"\")),0)","v":0},0,0,0,0,0,0,0,0,0,{"$f":"IF($CZ27>0,$V27-LEN(SUBSTITUTE($J27,AV$4,\"\")),0)","v":0},0,0,0,0,0,0,0,0,0,0,0,0,{"$f":"IF($CZ27>0,$V27-LEN(SUBSTITUTE($J27,BI$4,\"\")),0)","v":0},0,0,0,0,0,0,0,0,0,{"$f":"IF($CZ27>0,$V27-LEN(SUBSTITUTE($J27,BS$4,\"\")),0)","v":0},0,0,0,0,0,0,0,0,0,{"$f":"IF($CZ27>0,$V27-LEN(SUBSTITUTE($J27,CC$4,\"\")),0)","v":0},0,0,0,0,0,0,0,0,0,0,{"$f":"IF($CZ27>0,$V27-LEN(SUBSTITUTE($J27,CN$4,\"\")),0)","v":0},0,0,0,0,0,0,0,0,null,1,0,0,"","p","p",0]
["",0,0,0,0,null,null,null,null,null,"",{"$error":"#VALUE!"},"",{"$error":"#VALUE!"},"",{"$error":"#VALUE!"},"","","",{"$f":"IF(V28>0,COUNTIF(Q$7:Q28,\"=\"&Q28)-1,\"\")","v":""},"",0,0,0,0,0,0,0,0,0,0,0,0,0,0,0,0,0,0,0,0,0,0,0,0,0,0,0,0,0,0,0,0,0,0,0,0,0,0,0,0,0,0,0,0,0,0,0,0,0,0,0,0,0,0,0,0,0,0,0,0,0,0,0,0,0,0,0,0,0,0,0,0,0,0,0,0,0,0,0,null,1,0,0,"","p","p",0]
["",0,0,0,0,null,null,null,null,null,"",{"$error":"#VALUE!"},"",{"$error":"#VALUE!"},"",{"$error":"#VALUE!"},"","","",{"$f":"IF(V29>0,COUNTIF(Q$7:Q29,\"=\"&Q29)-1,\"\")","v":""},"",0,0,0,0,0,0,0,0,0,0,0,0,0,0,0,0,0,0,0,0,0,0,0,0,0,0,0,0,0,0,0,0,0,0,0,0,0,0,0,0,0,0,0,0,0,0,0,0,0,0,0,0,0,0,0,0,0,0,0,0,0,0,0,0,0,0,0,0,0,0,0,0,0,0,0,0,0,0,0,null,1,0,0,"","p","p",0]
["",0,0,0,0,null,null,null,null,null,"",{"$error":"#VALUE!"},"",{"$error":"#VALUE!"},"",{"$error":"#VALUE!"},"","","",{"$f":"IF(V30>0,COUNTIF(Q$7:Q30,\"=\"&Q30)-1,\"\")","v":""},"",0,0,0,0,0,0,0,0,0,0,0,0,0,0,0,0,0,0,0,0,0,0,0,0,0,0,0,0,0,0,0,0,0,0,0,0,0,0,0,0,0,0,0,0,0,0,0,0,0,0,0,0,0,0,0,0,0,0,0,0,0,0,0,0,0,0,0,0,0,0,0,0,0,0,0,0,0,0,0,null,1,0,0,"","p","p",0]
["",0,0,0,0,null,null,null,null,null,"",{"$error":"#VALUE!"},"",{"$error":"#VALUE!"},"",{"$error":"#VALUE!"},"","","",{"$f":"IF(V31>0,COUNTIF(Q$7:Q31,\"=\"&Q31)-1,\"\")","v":""},"",0,0,0,0,0,0,0,0,0,0,0,0,0,0,0,0,0,0,0,0,0,0,0,0,0,0,0,0,0,0,0,0,0,0,0,0,0,0,0,0,0,0,0,0,0,0,0,0,0,0,0,0,0,0,0,0,0,0,0,0,0,0,0,0,0,0,0,0,0,0,0,0,0,0,0,0,0,0,0,null,1,0,0,"","p","p",0]
["",0,0,0,0,null,null,null,null,null,"",{"$error":"#VALUE!"},"",{"$error":"#VALUE!"},"",{"$error":"#VALUE!"},"","","",{"$f":"IF(V32>0,COUNTIF(Q$7:Q32,\"=\"&Q32)-1,\"\")","v":""},"",0,0,0,0,0,0,0,0,0,0,0,0,0,0,0,0,0,0,0,0,0,0,0,0,0,0,0,0,0,0,0,0,0,0,0,0,0,0,0,0,0,0,0,0,0,0,0,0,0,0,0,0,0,0,0,0,0,0,0,0,0,0,0,0,0,0,0,0,0,0,0,0,0,0,0,0,0,0,0,null,1,0,0,"","p","p",0]
["",0,0,0,0,null,null,null,null,null,"",{"$error":"#VALUE!"},"",{"$error":"#VALUE!"},"",{"$error":"#VALUE!"},"","","",{"$f":"IF(V33>0,COUNTIF(Q$7:Q33,\"=\"&Q33)-1,\"\")","v":""},"",0,0,0,0,0,0,0,0,0,0,0,0,0,0,0,0,0,0,0,0,0,0,0,0,0,0,0,0,0,0,0,0,0,0,0,0,0,0,0,0,0,0,0,0,0,0,0,0,0,0,0,0,0,0,0,0,0,0,0,0,0,0,0,0,0,0,0,0,0,0,0,0,0,0,0,0,0,0,0,null,1,0,0,"","p","p",0]
["",0,0,0,0,null,null,null,null,null,"",{"$error":"#VALUE!"},"",{"$error":"#VALUE!"},"",{"$error":"#VALUE!"},"","","",{"$f":"IF(V34>0,COUNTIF(Q$7:Q34,\"=\"&Q34)-1,\"\")","v":""},"",0,0,0,0,0,0,0,0,0,0,0,0,0,0,0,0,0,0,0,0,0,0,0,0,0,0,0,0,0,0,0,0,0,0,0,0,0,0,0,0,0,0,0,0,0,0,0,0,0,0,0,0,0,0,0,0,0,0,0,0,0,0,0,0,0,0,0,0,0,0,0,0,0,0,0,0,0,0,0,null,1,0,0,"","p","p",0]
["",0,0,0,0,null,null,null,null,null,"",{"$error":"#VALUE!"},"",{"$error":"#VALUE!"},"",{"$error":"#VALUE!"},"","","",{"$f":"IF(V35>0,COUNTIF(Q$7:Q35,\"=\"&Q35)-1,\"\")","v":""},"",0,0,0,0,0,0,0,0,0,0,0,0,0,0,0,0,0,0,0,0,0,0,0,0,0,0,0,0,0,0,0,0,0,0,0,0,0,0,0,0,0,0,0,0,0,0,0,0,0,0,0,0,0,0,0,0,0,0,0,0,0,0,0,0,0,0,0,0,0,0,0,0,0,0,0,0,0,0,0,null,1,0,0,"","p","p",0]
["",0,0,0,0,null,null,null,null,null,"",{"$error":"#VALUE!"},"",{"$error":"#VALUE!"},"",{"$error":"#VALUE!"},"","","",{"$f":"IF(V36>0,COUNTIF(Q$7:Q36,\"=\"&Q36)-1,\"\")","v":""},"",0,0,0,0,0,0,0,0,0,0,0,0,0,0,0,0,0,0,0,0,0,0,0,0,0,0,0,0,0,0,0,0,0,0,0,0,0,0,0,0,0,0,0,0,0,0,0,0,0,0,0,0,0,0,0,0,0,0,0,0,0,0,0,0,0,0,0,0,0,0,0,0,0,0,0,0,0,0,0,null,1,0,0,"","p","p",0]
["",0,0,0,0,null,null,null,null,null,"",{"$error":"#VALUE!"},"",{"$error":"#VALUE!"},"",{"$error":"#VALUE!"},"","","",{"$f":"IF(V37>0,COUNTIF(Q$7:Q37,\"=\"&Q37)-1,\"\")","v":""},"",0,{"$f":"$V37-LEN(SUBSTITUTE($J37,W$4,\"\"))","v":0},0,0,0,0,{"$f":"IF($CZ37>0,$V37-LEN(SUBSTITUTE($J37,AB$4,\"\")),0)","v":0},0,0,0,0,0,0,0,0,0,{"$f":"IF($CZ37>0,$V37-LEN(SUBSTITUTE($J37,AL$4,\"\")),0)","v":0},0,0,0,0,0,0,0,0,0,{"$f":"IF($CZ37>0,$V37-LEN(SUBSTITUTE($J37,AV$4,\"\")),0)","v":0},0,0,0,0,0,0,0,0,0,0,0,0,{"$f":"IF($CZ37>0,$V37-LEN(SUBSTITUTE($J37,BI$4,\"\")),0)","v":0},0,0,0,0,0,0,0,0,0,{"$f":"IF($CZ37>0,$V37-LEN(SUBSTITUTE($J37,BS$4,\"\")),0)","v":0},0,0,0,0,0,0,0,0,0,{"$f":"IF($CZ37>0,$V37-LEN(SUBSTITUTE($J37,CC$4,\"\")),0)","v":0},0,0,0,0,0,0,0,0,0,0,0,0,0,0,0,0,0,0,0,null,1,0,0,"","p","p",0]
["",0,0,0,0,null,null,null,null,null,"",{"$error":"#VALUE!"},"",{"$error":"#VALUE!"},"",{"$error":"#VALUE!"},"","","",{"$f":"IF(V38>0,COUNTIF(Q$7:Q38,\"=\"&Q38)-1,\"\")","v":""},"",0,0,0,0,0,0,0,0,0,0,0,0,0,0,0,0,0,0,0,0,0,0,0,0,0,0,0,0,0,0,0,0,0,0,0,0,0,0,0,0,0,0,0,0,0,0,0,0,0,0,0,0,0,0,0,0,0,0,0,0,0,0,0,0,0,0,0,0,0,0,0,0,0,0,0,0,0,0,0,null,1,0,0,"","p","p",0]
["",0,0,0,0,null,null,null,null,null,"",{"$error":"#VALUE!"},"",{"$error":"#VALUE!"},"",{"$error":"#VALUE!"},"","","",{"$f":"IF(V39>0,COUNTIF(Q$7:Q39,\"=\"&Q39)-1,\"\")","v":""},"",{"$f":"LEN(J39)","v":0},0,0,0,0,0,0,0,0,0,0,0,0,0,0,0,0,0,0,0,0,0,0,0,0,0,0,0,0,0,0,0,0,0,0,0,0,0,{"$f":"IF($CZ39>0,$V39-LEN(SUBSTITUTE($J39,BH$4,\"\")),0)+DD39","v":0},0,0,0,0,0,0,0,0,0,0,0,0,0,0,0,0,0,0,0,0,0,0,0,0,0,0,0,0,0,0,0,0,0,0,0,{"$f":"IF($CZ39>0,$V39-LEN(SUBSTITUTE($J39,CR$4,\"\")),0)","v":0},0,0,0,0,null,1,0,0,"","p",{"$f":"DA39&J39&DB39","v":"p"},0]
["",0,0,0,0,null,null,null,null,null,"",{"$error":"#VALUE!"},"",{"$error":"#VALUE!"},"",{"$error":"#VALUE!"},"","","",{"$f":"IF(V40>0,COUNTIF(Q$7:Q40,\"=\"&Q40)-1,\"\")","v":""},"",0,0,0,0,0,0,0,0,0,0,0,0,0,0,0,0,0,0,0,0,0,0,0,0,0,0,0,0,0,0,0,0,0,0,0,0,0,0,0,0,0,0,0,0,0,0,0,0,0,0,0,0,0,0,0,0,0,0,0,0,0,0,0,0,0,0,0,0,0,0,0,0,0,0,0,0,0,0,0,null,1,0,0,"","p","p",0]
["",0,0,0,0,null,null,null,null,null,"",{"$error":"#VALUE!"},"",{"$error":"#VALUE!"},"",{"$error":"#VALUE!"},"","","",{"$f":"IF(V41>0,COUNTIF(Q$7:Q41,\"=\"&Q41)-1,\"\")","v":""},"",0,0,0,0,0,0,0,0,0,0,0,0,0,0,0,0,0,0,0,0,0,0,0,0,0,0,0,0,0,0,0,0,0,0,0,0,0,0,0,0,0,0,0,0,0,0,0,0,0,0,0,0,0,0,0,0,0,0,0,0,0,0,0,0,0,0,0,0,0,0,0,0,0,0,0,0,0,0,0,null,1,0,0,"","p","p",0]
["",0,0,0,0,null,null,null,null,null,"",{"$error":"#VALUE!"},"",{"$error":"#VALUE!"},"",{"$error":"#VALUE!"},"","","",{"$f":"IF(V42>0,COUNTIF(Q$7:Q42,\"=\"&Q42)-1,\"\")","v":""},"",0,0,0,0,0,0,0,0,0,0,0,0,0,0,0,0,0,0,0,0,0,0,0,0,0,0,0,0,0,0,0,0,0,0,0,0,0,0,0,0,0,0,0,0,0,0,0,0,0,0,0,0,0,0,0,0,0,0,0,0,0,0,0,0,0,0,0,0,0,0,0,0,0,0,0,0,0,0,0,null,1,0,0,"","p","p",0]
["",0,0,0,0,null,null,null,null,null,"",{"$error":"#VALUE!"},"",{"$error":"#VALUE!"},"",{"$error":"#VALUE!"},"","","",{"$f":"IF(V43>0,COUNTIF(Q$7:Q43,\"=\"&Q43)-1,\"\")","v":""},"",0,0,0,0,0,0,0,0,0,0,0,0,0,0,0,0,0,0,0,0,0,0,0,0,0,0,0,0,0,0,0,0,0,0,0,0,0,0,0,0,0,0,0,0,0,0,0,0,0,0,0,0,0,0,0,0,0,0,0,0,0,0,0,0,0,0,0,0,0,0,0,0,0,0,0,0,0,0,0,null,1,0,0,"","p","p",0]
["",0,0,0,0,null,null,null,null,null,"",{"$error":"#VALUE!"},"",{"$error":"#VALUE!"},"",{"$error":"#VALUE!"},"","","",{"$f":"IF(V44>0,COUNTIF(Q$7:Q44,\"=\"&Q44)-1,\"\")","v":""},"",0,0,0,0,0,0,0,0,0,0,0,0,0,0,0,0,0,0,0,0,0,0,0,0,0,0,0,0,0,0,0,0,0,0,0,0,0,0,0,0,0,0,0,0,0,0,0,0,0,0,0,0,0,0,0,0,0,0,0,0,0,0,0,0,0,0,0,0,0,0,0,0,0,0,0,0,0,0,0,null,1,0,0,"","p","p",0]
["",0,0,0,0,null,null,null,null,null,"",{"$error":"#VALUE!"},"",{"$error":"#VALUE!"},"",{"$error":"#VALUE!"},"","","",{"$f":"IF(V45>0,COUNTIF(Q$7:Q45,\"=\"&Q45)-1,\"\")","v":""},"",0,0,0,0,0,0,0,0,0,0,0,0,0,0,0,0,0,0,0,0,0,0,0,0,0,0,0,0,0,0,0,0,0,0,0,0,0,0,0,0,0,0,0,0,0,0,0,0,0,0,0,0,0,0,0,0,0,0,0,0,0,0,0,0,0,0,0,0,0,0,0,0,0,0,0,0,0,0,0,null,1,0,0,"","p","p",0]
["",0,0,0,0,null,null,null,null,null,"",{"$error":"#VALUE!"},"",{"$error":"#VALUE!"},"",{"$error":"#VALUE!"},"","","",{"$f":"IF(V46>0,COUNTIF(Q$7:Q46,\"=\"&Q46)-1,\"\")","v":""},"",0,0,0,0,0,0,0,0,0,0,0,0,0,0,0,0,0,0,0,0,0,0,0,0,0,0,0,0,0,0,0,0,0,0,0,0,0,0,0,0,0,0,0,0,0,0,0,0,0,0,0,0,0,0,0,0,0,0,0,0,0,0,0,0,0,0,0,0,0,0,0,0,0,0,0,0,0,0,0,null,1,0,0,"","p","p",0]
["",0,0,0,0,null,null,null,null,null,"",{"$error":"#VALUE!"},"",{"$error":"#VALUE!"},"",{"$error":"#VALUE!"},"","","",{"$f":"IF(V47>0,COUNTIF(Q$7:Q47,\"=\"&Q47)-1,\"\")","v":""},"",0,{"$f":"$V47-LEN(SUBSTITUTE($J47,W$4,\"\"))","v":0},0,0,0,0,{"$f":"IF($CZ47>0,$V47-LEN(SUBSTITUTE($J47,AB$4,\"\")),0)","v":0},0,0,0,0,0,0,0,0,0,{"$f":"IF($CZ47>0,$V47-LEN(SUBSTITUTE($J47,AL$4,\"\")),0)","v":0},0,0,0,0,0,0,0,0,0,{"$f":"IF($CZ47>0,$V47-LEN(SUBSTITUTE($J47,AV$4,\"\")),0)","v":0},0,0,0,0,0,0,0,0,0,0,0,0,{"$f":"IF($CZ47>0,$V47-LEN(SUBSTITUTE($J47,BI$4,\"\")),0)","v":0},0,0,0,0,0,0,0,0,0,{"$f":"IF($CZ47>0,$V47-LEN(SUBSTITUTE($J47,BS$4,\"\")),0)","v":0},0,0,0,0,0,0,0,0,0,{"$f":"IF($CZ47>0,$V47-LEN(SUBSTITUTE($J47,CC$4,\"\")),0)","v":0},0,0,0,0,0,0,0,0,0,0,{"$f":"IF($CZ47>0,$V47-LEN(SUBSTITUTE($J47,CN$4,\"\")),0)","v":0},0,0,0,0,0,0,0,0,null,1,0,0,"","p","p",0]
["",0,0,0,0,null,null,null,null,null,"",{"$error":"#VALUE!"},"",{"$error":"#VALUE!"},"",{"$error":"#VALUE!"},"","","",{"$f":"IF(V48>0,COUNTIF(Q$7:Q48,\"=\"&Q48)-1,\"\")","v":""},"",0,0,0,0,0,0,0,0,0,0,0,0,0,0,0,0,0,0,0,0,0,0,0,0,0,0,0,0,0,0,0,0,0,0,0,0,0,0,0,0,0,0,0,0,0,0,0,0,0,0,0,0,0,0,0,0,0,0,0,0,0,0,0,0,0,0,0,0,0,0,0,0,0,0,0,0,0,0,0,null,1,0,0,"","p","p",0]
["",0,0,0,0,null,null,null,null,null,"",{"$error":"#VALUE!"},"",{"$error":"#VALUE!"},"",{"$error":"#VALUE!"},"","","",{"$f":"IF(V49>0,COUNTIF(Q$7:Q49,\"=\"&Q49)-1,\"\")","v":""},"",0,0,0,0,0,0,0,0,0,0,0,0,0,0,0,0,0,0,0,0,0,0,0,0,0,0,0,0,0,0,0,0,0,0,0,0,0,0,0,0,0,0,0,0,0,0,0,0,0,0,0,0,0,0,0,0,0,0,0,0,0,0,0,0,0,0,0,0,0,0,0,0,0,0,0,0,0,0,0,null,1,0,0,"","p","p",0]
["",0,0,0,0,null,null,null,null,null,"",{"$error":"#VALUE!"},"",{"$error":"#VALUE!"},"",{"$error":"#VALUE!"},"","","",{"$f":"IF(V50>0,COUNTIF(Q$7:Q50,\"=\"&Q50)-1,\"\")","v":""},"",0,0,0,0,0,0,0,0,0,0,0,0,0,0,0,0,0,0,0,0,0,0,0,0,0,0,0,0,0,0,0,0,0,0,0,0,0,0,0,0,0,0,0,0,0,0,0,0,0,0,0,0,0,0,0,0,0,0,0,0,0,0,0,0,0,0,0,0,0,0,0,0,0,0,0,0,0,0,0,null,1,0,0,"","p","p",0]
["",0,0,0,0,null,null,null,null,null,"",{"$error":"#VALUE!"},"",{"$error":"#VALUE!"},"",{"$error":"#VALUE!"},"","","",{"$f":"IF(V51>0,COUNTIF(Q$7:Q51,\"=\"&Q51)-1,\"\")","v":""},"",0,0,0,0,0,0,0,0,0,0,0,0,0,0,0,0,0,0,0,0,0,0,0,0,0,0,0,0,0,0,0,0,0,0,0,0,0,0,0,0,0,0,0,0,0,0,0,0,0,0,0,0,0,0,0,0,0,0,0,0,0,0,0,0,0,0,0,0,0,0,0,0,0,0,0,0,0,0,0,null,1,0,0,"","p","p",0]
["",0,0,0,0,null,null,null,null,null,"",{"$error":"#VALUE!"},"",{"$error":"#VALUE!"},"",{"$error":"#VALUE!"},"","","",{"$f":"IF(V52>0,COUNTIF(Q$7:Q52,\"=\"&Q52)-1,\"\")","v":""},"",0,0,0,0,0,0,0,0,0,0,0,0,0,0,0,0,0,0,0,0,0,0,0,0,0,0,0,0,0,0,0,0,0,0,0,0,0,0,0,0,0,0,0,0,0,0,0,0,0,0,0,0,0,0,0,0,0,0,0,0,0,0,0,0,0,0,0,0,0,0,0,0,0,0,0,0,0,0,0,null,1,0,0,"","p","p",0]
["",0,0,0,0,null,null,null,null,null,"",{"$error":"#VALUE!"},"",{"$error":"#VALUE!"},"",{"$error":"#VALUE!"},"","","",{"$f":"IF(V53>0,COUNTIF(Q$7:Q53,\"=\"&Q53)-1,\"\")","v":""},"",0,0,0,0,0,0,0,0,0,0,0,0,0,0,0,0,0,0,0,0,0,0,0,0,0,0,0,0,0,0,0,0,0,0,0,0,0,0,0,0,0,0,0,0,0,0,0,0,0,0,0,0,0,0,0,0,0,0,0,0,0,0,0,0,0,0,0,0,0,0,0,0,0,0,0,0,0,0,0,null,1,0,0,"","p","p",0]
["",0,0,0,0,null,null,null,null,null,"",{"$error":"#VALUE!"},"",{"$error":"#VALUE!"},"",{"$error":"#VALUE!"},"","","",{"$f":"IF(V54>0,COUNTIF(Q$7:Q54,\"=\"&Q54)-1,\"\")","v":""},"",0,0,0,0,0,0,0,0,0,0,0,0,0,0,0,0,0,0,0,0,0,0,0,0,0,0,0,0,0,0,0,0,0,0,0,0,0,0,0,0,0,0,0,0,0,0,0,0,0,0,0,0,0,0,0,0,0,0,0,0,0,0,0,0,0,0,0,0,0,0,0,0,0,0,0,0,0,0,0,null,1,0,0,"","p","p",0]
["",0,0,0,0,null,null,null,null,null,"",{"$error":"#VALUE!"},"",{"$error":"#VALUE!"},"",{"$error":"#VALUE!"},"","","",{"$f":"IF(V55>0,COUNTIF(Q$7:Q55,\"=\"&Q55)-1,\"\")","v":""},"",0,0,0,0,0,0,0,0,0,0,0,0,0,0,0,0,0,0,0,0,0,0,0,0,0,0,0,0,0,0,0,0,0,0,0,0,0,0,0,0,0,0,0,0,0,0,0,0,0,0,0,0,0,0,0,0,0,0,0,0,0,0,0,0,0,0,0,0,0,0,0,0,0,0,{"$f":"IF($CZ55>0,$V55-LEN(SUBSTITUTE($J55,CR$4,\"\")),0)","v":0},0,0,0,0,null,1,0,0,"","p","p",0]
["",0,0,0,0,null,null,null,null,null,"",{"$error":"#VALUE!"},"",{"$error":"#VALUE!"},"",{"$error":"#VALUE!"},"","","",{"$f":"IF(V56>0,COUNTIF(Q$7:Q56,\"=\"&Q56)-1,\"\")","v":""},"",0,0,0,0,0,0,0,0,0,0,0,0,0,0,0,0,0,0,0,0,0,0,0,0,0,0,0,0,0,0,0,0,0,0,0,0,0,0,0,0,0,0,0,0,0,0,0,0,0,0,0,0,0,0,0,0,0,0,0,0,0,0,0,0,0,0,0,0,0,0,0,0,0,0,0,0,0,0,0,null,1,0,0,"","p","p",0]
["",0,0,0,0,null,null,null,null,null,"",{"$error":"#VALUE!"},"",{"$error":"#VALUE!"},"",{"$error":"#VALUE!"},"","","",{"$f":"IF(V57>0,COUNTIF(Q$7:Q57,\"=\"&Q57)-1,\"\")","v":""},"",0,{"$f":"$V57-LEN(SUBSTITUTE($J57,W$4,\"\"))","v":0},0,0,0,0,{"$f":"IF($CZ57>0,$V57-LEN(SUBSTITUTE($J57,AB$4,\"\")),0)","v":0},0,0,0,0,0,0,0,0,0,{"$f":"IF($CZ57>0,$V57-LEN(SUBSTITUTE($J57,AL$4,\"\")),0)","v":0},0,0,0,0,0,0,0,0,0,{"$f":"IF($CZ57>0,$V57-LEN(SUBSTITUTE($J57,AV$4,\"\")),0)","v":0},0,0,0,0,0,0,0,0,0,0,0,0,{"$f":"IF($CZ57>0,$V57-LEN(SUBSTITUTE($J57,BI$4,\"\")),0)","v":0},0,0,0,0,0,0,0,0,0,{"$f":"IF($CZ57>0,$V57-LEN(SUBSTITUTE($J57,BS$4,\"\")),0)","v":0},0,0,0,0,0,0,0,0,0,{"$f":"IF($CZ57>0,$V57-LEN(SUBSTITUTE($J57,CC$4,\"\")),0)","v":0},0,0,0,0,0,0,0,0,0,0,0,0,0,0,0,0,0,0,0,null,1,0,0,"","p","p",0]
["",0,0,0,0,null,null,null,null,null,"",{"$error":"#VALUE!"},"",{"$error":"#VALUE!"},"",{"$error":"#VALUE!"},"","","",{"$f":"IF(V58>0,COUNTIF(Q$7:Q58,\"=\"&Q58)-1,\"\")","v":""},"",0,0,0,0,0,0,0,0,0,0,0,0,0,0,0,0,0,0,0,0,0,0,0,0,0,0,0,0,0,0,0,0,0,0,0,0,0,0,0,0,0,0,0,0,0,0,0,0,0,0,0,0,0,0,0,0,0,0,0,0,0,0,0,0,0,0,0,0,0,0,0,0,0,0,0,0,0,0,0,null,1,0,0,"","p","p",0]
["",0,0,0,0,null,null,null,null,null,"",{"$error":"#VALUE!"},"",{"$error":"#VALUE!"},"",{"$error":"#VALUE!"},"","","",{"$f":"IF(V59>0,COUNTIF(Q$7:Q59,\"=\"&Q59)-1,\"\")","v":""},"",0,0,0,0,0,0,0,0,0,0,0,0,0,0,0,0,0,0,0,0,0,0,0,0,0,0,0,0,0,0,0,0,0,0,0,0,0,0,0,0,0,0,0,0,0,0,0,0,0,0,0,0,0,0,0,0,0,0,0,0,0,0,0,0,0,0,0,0,0,0,0,0,0,0,0,0,0,0,0,null,1,0,0,"","p","p",0]
["",0,0,0,0,null,null,null,null,null,"",{"$error":"#VALUE!"},"",{"$error":"#VALUE!"},"",{"$error":"#VALUE!"},"","","",{"$f":"IF(V60>0,COUNTIF(Q$7:Q60,\"=\"&Q60)-1,\"\")","v":""},"",0,0,0,0,0,0,0,0,0,0,0,0,0,0,0,0,0,0,0,0,0,0,0,0,0,0,0,0,0,0,0,0,0,0,0,0,0,0,0,0,0,0,0,0,0,0,0,0,0,0,0,0,0,0,0,0,0,0,0,0,0,0,0,0,0,0,0,0,0,0,0,0,0,0,0,0,0,0,0,null,1,0,0,"","p","p",0]
["",0,0,0,0,null,null,null,null,null,"",{"$error":"#VALUE!"},"",{"$error":"#VALUE!"},"",{"$error":"#VALUE!"},"","","",{"$f":"IF(V61>0,COUNTIF(Q$7:Q61,\"=\"&Q61)-1,\"\")","v":""},"",0,0,0,0,0,0,0,0,0,0,0,0,0,0,0,0,0,0,0,0,0,0,0,0,0,0,0,0,0,0,0,0,0,0,0,0,0,0,0,0,0,0,0,0,0,0,0,0,0,0,0,0,0,0,0,0,0,0,0,0,0,0,0,0,0,0,0,0,0,0,0,0,0,0,0,0,0,0,0,null,1,0,0,"","p","p",0]
["",0,0,0,0,null,null,null,null,null,"",{"$error":"#VALUE!"},"",{"$error":"#VALUE!"},"",{"$error":"#VALUE!"},"","","",{"$f":"IF(V62>0,COUNTIF(Q$7:Q62,\"=\"&Q62)-1,\"\")","v":""},"",0,0,0,0,0,0,0,0,0,0,0,0,0,0,0,0,0,0,0,0,0,0,0,0,0,0,0,0,0,0,0,0,0,0,0,0,0,0,0,0,0,0,0,0,0,0,0,0,0,0,0,0,0,0,0,0,0,0,0,0,0,0,0,0,0,0,0,0,0,0,0,0,0,0,0,0,0,0,0,null,1,0,0,"","p","p",0]
["",0,0,0,0,null,null,null,null,null,"",{"$error":"#VALUE!"},"",{"$error":"#VALUE!"},"",{"$error":"#VALUE!"},"","","",{"$f":"IF(V63>0,COUNTIF(Q$7:Q63,\"=\"&Q63)-1,\"\")","v":""},"",0,0,0,0,0,0,0,0,0,0,0,0,0,0,0,0,0,0,0,0,0,0,0,0,0,0,0,0,0,0,0,0,0,0,0,0,0,0,0,0,0,0,0,0,0,0,0,0,0,0,0,0,0,0,0,0,0,0,0,0,0,0,0,0,0,0,0,0,0,0,0,0,0,0,0,0,0,0,0,null,1,0,0,"","p","p",0]
["",0,0,0,0,null,null,null,null,null,"",{"$error":"#VALUE!"},"",{"$error":"#VALUE!"},"",{"$error":"#VALUE!"},"","","",{"$f":"IF(V64>0,COUNTIF(Q$7:Q64,\"=\"&Q64)-1,\"\")","v":""},"",0,0,0,0,0,0,0,0,0,0,0,0,0,0,0,0,0,0,0,0,0,0,0,0,0,0,0,0,0,0,0,0,0,0,0,0,0,0,0,0,0,0,0,0,0,0,0,0,0,0,0,0,0,0,0,0,0,0,0,0,0,0,0,0,0,0,0,0,0,0,0,0,0,0,0,0,0,0,0,null,1,0,0,"","p","p",0]
["",0,0,0,0,null,null,null,null,null,"",{"$error":"#VALUE!"},"",{"$error":"#VALUE!"},"",{"$error":"#VALUE!"},"","","",{"$f":"IF(V65>0,COUNTIF(Q$7:Q65,\"=\"&Q65)-1,\"\")","v":""},"",0,0,0,0,0,0,0,0,0,0,0,0,0,0,0,0,0,0,0,0,0,0,0,0,0,0,0,0,0,0,0,0,0,0,0,0,0,0,0,0,0,0,0,0,0,0,0,0,0,0,0,0,0,0,0,0,0,0,0,0,0,0,0,0,0,0,0,0,0,0,0,0,0,0,0,0,0,0,0,null,1,0,0,"","p","p",0]
["",0,0,0,0,null,null,null,null,null,"",{"$error":"#VALUE!"},"",{"$error":"#VALUE!"},"",{"$error":"#VALUE!"},"","","",{"$f":"IF(V66>0,COUNTIF(Q$7:Q66,\"=\"&Q66)-1,\"\")","v":""},"",0,0,0,0,0,0,0,0,0,0,0,0,0,0,0,0,0,0,0,0,0,0,0,0,0,0,0,0,0,0,0,0,0,0,0,0,0,0,0,0,0,0,0,0,0,0,0,0,0,0,0,0,0,0,0,0,0,0,0,0,0,0,0,0,0,0,0,0,0,0,0,0,0,0,0,0,0,0,0,null,1,0,0,"","p","p",0]
["",0,0,0,0,null,null,null,null,null,"",{"$error":"#VALUE!"},"",{"$error":"#VALUE!"},"",{"$error":"#VALUE!"},"","","",{"$f":"IF(V67>0,COUNTIF(Q$7:Q67,\"=\"&Q67)-1,\"\")","v":""},"",0,{"$f":"$V67-LEN(SUBSTITUTE($J67,W$4,\"\"))","v":0},0,0,0,0,{"$f":"IF($CZ67>0,$V67-LEN(SUBSTITUTE($J67,AB$4,\"\")),0)","v":0},0,0,0,0,0,0,0,0,0,{"$f":"IF($CZ67>0,$V67-LEN(SUBSTITUTE($J67,AL$4,\"\")),0)","v":0},0,0,0,0,0,0,0,0,0,{"$f":"IF($CZ67>0,$V67-LEN(SUBSTITUTE($J67,AV$4,\"\")),0)","v":0},0,0,0,0,0,0,0,0,0,0,0,0,{"$f":"IF($CZ67>0,$V67-LEN(SUBSTITUTE($J67,BI$4,\"\")),0)","v":0},0,0,0,0,0,0,0,0,0,{"$f":"IF($CZ67>0,$V67-LEN(SUBSTITUTE($J67,BS$4,\"\")),0)","v":0},0,0,0,0,0,0,0,0,0,{"$f":"IF($CZ67>0,$V67-LEN(SUBSTITUTE($J67,CC$4,\"\")),0)","v":0},0,0,0,0,0,0,0,0,0,0,{"$f":"IF($CZ67>0,$V67-LEN(SUBSTITUTE($J67,CN$4,\"\")),0)","v":0},0,0,0,0,0,0,0,0,null,1,0,0,"","p","p",0]
["",0,0,0,0,null,null,null,null,null,"",{"$error":"#VALUE!"},"",{"$error":"#VALUE!"},"",{"$error":"#VALUE!"},"","","",{"$f":"IF(V68>0,COUNTIF(Q$7:Q68,\"=\"&Q68)-1,\"\")","v":""},"",0,0,0,0,0,0,0,0,0,0,0,0,0,0,0,0,0,0,0,0,0,0,0,0,0,0,0,0,0,0,0,0,0,0,0,0,0,0,0,0,0,0,0,0,0,0,0,0,0,0,0,0,0,0,0,0,0,0,0,0,0,0,0,0,0,0,0,0,0,0,0,0,0,0,0,0,0,0,0,null,1,0,0,"","p","p",0]
["",0,0,0,0,null,null,null,null,null,"",{"$error":"#VALUE!"},"",{"$error":"#VALUE!"},"",{"$error":"#VALUE!"},"","","",{"$f":"IF(V69>0,COUNTIF(Q$7:Q69,\"=\"&Q69)-1,\"\")","v":""},"",0,0,0,0,0,0,0,0,0,0,0,0,0,0,0,0,0,0,0,0,0,0,0,0,0,0,0,0,0,0,0,0,0,0,0,0,0,0,0,0,0,0,0,0,0,0,0,0,0,0,0,0,0,0,0,0,0,0,0,0,0,0,0,0,0,0,0,0,0,0,0,0,0,0,0,0,0,0,0,null,1,0,0,"","p","p",0]
["",0,0,0,0,null,null,null,null,null,"",{"$error":"#VALUE!"},"",{"$error":"#VALUE!"},"",{"$error":"#VALUE!"},"","","",{"$f":"IF(V70>0,COUNTIF(Q$7:Q70,\"=\"&Q70)-1,\"\")","v":""},"",0,0,0,0,0,0,0,0,0,0,0,0,0,0,0,0,0,0,0,0,0,0,0,0,0,0,0,0,0,0,0,0,0,0,0,0,0,0,0,0,0,0,0,0,0,0,0,0,0,0,0,0,0,0,0,0,0,0,0,0,0,0,0,0,0,0,0,0,0,0,0,0,0,0,0,0,0,0,0,null,1,0,0,"","p","p",0]
[{"$f":"IF(V71=0,\"\",A70+1)","v":""},0,{"$f":"IF($C$2=\"forced-OH\",-1,IF($G71=1,$C$3,IF($G71=2,$D$3,0)))","v":0},{"$f":"IF($F71=1,VLOOKUP($B$2,$DE$5:$DI$11,5,FALSE),0)","v":0},{"$f":"IF($F71=1,VLOOKUP($B$2,$DE$5:$DG$11,3,FALSE),0)","v":0},null,null,null,null,null,{"$f":"IF(V71=0,\"\",SUMPRODUCT(W$5:CY$5,W71:CY71))","v":""},{"$f":"IF(C71=-1,\"\",K71-18.01528)","v":{"$error":"#VALUE!"}},{"$f":"IF(V71=0,\"\",SUMPRODUCT(W$6:CY$6,W71:CY71))","v":""},{"$f":"IF(C71=-1,\"\",M71-18.0105646861)","v":{"$error":"#VALUE!"}},{"$f":"IF(V71=0,\"\",M71+TRUNC(K71-M71-0.1))","v":""},{"$f":"IF(C71=-1,\"\",O71-18.0105646861)","v":{"$error":"#VALUE!"}},{"$f":"IF(V71>0,ROUND(K71,4),\"\")","v":""},{"$f":"IF(V71>0,S71+T71,\"\")","v":""},{"$f":"IF(V71>0,COUNTIF(Q$7:Q$651,\"<\"&Q71)+1,\"\")","v":""},{"$f":"IF(V71>0,COUNTIF(Q$7:Q71,\"=\"&Q71)-1,\"\")","v":""},{"$f":"IF(V71>0,$R$6-R71+1,\"\")","v":""},{"$f":"LEN(J71)","v":0},0,0,0,0,0,0,0,0,0,0,0,0,0,0,0,0,0,0,0,0,0,0,0,0,0,0,0,0,0,0,0,0,0,0,0,0,0,{"$f":"IF($CZ71>0,$V71-LEN(SUBSTITUTE($J71,BH$4,\"\")),0)+DD71","v":0},0,0,0,0,0,0,0,0,0,0,0,0,0,0,0,0,0,0,0,0,0,0,0,0,0,0,0,0,0,0,0,0,0,0,0,{"$f":"IF($CZ71>0,$V71-LEN(SUBSTITUTE($J71,CR$4,\"\")),0)","v":0},0,0,0,{"$f":"V71+B71+C71","v":0},null,{"$f":"-(V71-1)+D71","v":1},{"$f":"E71","v":0},{"$f":"$V71-$W71-$X71-$Z71-$AA71","v":0},"",{"$f":"IF($C71=0,\"p\",\"\")","v":"p"},{"$f":"DA71&J71&DB71","v":"p"},{"$f":"IF($F71=1,VLOOKUP($B$2,$DE$5:$DH$11,4,FALSE),0)","v":0}]
["",{"$f":"IF($F72=1,VLOOKUP($B$2,$DE$5:$DG$11,2,FALSE),IF($F72=2,VLOOKUP($B$3,$DE$5:$DG$6,2,FALSE),0))","v":0},0,0,0,null,null,null,null,null,"",{"$error":"#VALUE!"},"",{"$error":"#VALUE!"},"",{"$error":"#VALUE!"},"","","",{"$f":"IF(V72>0,COUNTIF(Q$7:Q72,\"=\"&Q72)-1,\"\")","v":""},"",0,0,0,0,0,0,0,0,0,0,0,0,0,0,0,0,0,0,0,0,0,0,0,0,0,0,0,0,0,0,0,0,0,0,0,0,0,0,0,0,0,0,0,0,0,0,0,0,0,0,0,0,0,0,0,0,0,0,0,0,0,0,0,0,0,0,0,0,0,0,0,0,0,0,0,0,0,0,0,null,1,0,0,{"$f":"IF($B72=0,\"\",IF(F72=1,LEFT($B$2,LEN($B$2)-1),LEFT($B$3,LEN($B$3)-1)))","v":""},"p","p",0]
["",0,0,0,0,null,null,null,null,null,"",{"$error":"#VALUE!"},"",{"$error":"#VALUE!"},"",{"$error":"#VALUE!"},"","","",{"$f":"IF(V73>0,COUNTIF(Q$7:Q73,\"=\"&Q73)-1,\"\")","v":""},"",0,0,0,0,0,0,0,0,0,0,0,0,0,0,0,0,0,0,0,0,0,0,0,0,0,0,0,0,0,0,0,0,0,0,0,0,0,0,0,0,0,0,0,0,0,0,0,0,0,0,0,0,0,0,0,0,0,0,0,0,0,0,0,0,0,0,0,0,0,0,0,0,0,0,0,0,0,0,0,null,1,0,0,"","p","p",0]
["",0,0,0,0,null,null,null,null,null,"",{"$error":"#VALUE!"},"",{"$error":"#VALUE!"},"",{"$error":"#VALUE!"},"","","",{"$f":"IF(V74>0,COUNTIF(Q$7:Q74,\"=\"&Q74)-1,\"\")","v":""},"",0,0,0,0,0,0,0,0,0,0,0,0,0,0,0,0,0,0,0,0,0,0,0,0,0,0,0,0,0,0,0,0,0,0,0,0,0,0,0,0,0,0,0,0,0,0,0,0,0,0,0,0,0,0,0,0,0,0,0,0,0,0,0,0,0,0,0,0,0,0,0,0,0,0,0,0,0,0,0,null,1,0,0,"","p","p",0]
["",0,0,0,0,null,null,null,null,null,"",{"$error":"#VALUE!"},"",{"$error":"#VALUE!"},"",{"$error":"#VALUE!"},"","","",{"$f":"IF(V75>0,COUNTIF(Q$7:Q75,\"=\"&Q75)-1,\"\")","v":""},"",0,0,0,0,0,0,0,0,0,0,0,0,0,0,0,0,0,0,0,0,0,0,0,0,0,0,0,0,0,0,0,0,0,0,0,0,0,0,0,0,0,0,0,0,0,0,0,0,0,0,0,0,0,0,0,0,0,0,0,0,0,0,0,0,0,0,0,0,0,0,0,0,0,0,0,0,0,0,0,null,1,0,0,"","p","p",0]
["",0,0,0,0,null,null,null,null,null,"",{"$error":"#VALUE!"},"",{"$error":"#VALUE!"},"",{"$error":"#VALUE!"},"","","",{"$f":"IF(V76>0,COUNTIF(Q$7:Q76,\"=\"&Q76)-1,\"\")","v":""},"",0,0,0,0,0,0,0,0,0,0,0,0,0,0,0,0,0,0,0,0,0,0,0,0,0,0,0,0,0,0,0,0,0,0,0,0,0,0,0,0,0,0,0,0,0,0,0,0,0,0,0,0,0,0,0,0,0,0,0,0,0,0,0,0,0,0,0,0,0,0,0,0,0,0,0,0,0,0,0,null,1,0,0,"","p","p",0]
["",0,0,0,0,null,null,null,null,null,"",{"$error":"#VALUE!"},"",{"$error":"#VALUE!"},"",{"$error":"#VALUE!"},"","","",{"$f":"IF(V77>0,COUNTIF(Q$7:Q77,\"=\"&Q77)-1,\"\")","v":""},"",0,{"$f":"$V77-LEN(SUBSTITUTE($J77,W$4,\"\"))","v":0},0,0,0,0,{"$f":"IF($CZ77>0,$V77-LEN(SUBSTITUTE($J77,AB$4,\"\")),0)","v":0},0,0,0,0,0,0,0,0,0,{"$f":"IF($CZ77>0,$V77-LEN(SUBSTITUTE($J77,AL$4,\"\")),0)","v":0},0,0,0,0,0,0,0,0,0,{"$f":"IF($CZ77>0,$V77-LEN(SUBSTITUTE($J77,AV$4,\"\")),0)","v":0},0,0,0,0,0,0,0,0,0,0,0,0,{"$f":"IF($CZ77>0,$V77-LEN(SUBSTITUTE($J77,BI$4,\"\")),0)","v":0},0,0,0,0,0,0,0,0,0,{"$f":"IF($CZ77>0,$V77-LEN(SUBSTITUTE($J77,BS$4,\"\")),0)","v":0},0,0,0,0,0,0,0,0,0,{"$f":"IF($CZ77>0,$V77-LEN(SUBSTITUTE($J77,CC$4,\"\")),0)","v":0},0,0,0,0,0,0,0,0,0,0,0,0,0,0,0,0,0,0,0,null,1,0,0,"","p","p",0]
["",0,0,0,0,null,null,null,null,null,"",{"$error":"#VALUE!"},"",{"$error":"#VALUE!"},"",{"$error":"#VALUE!"},"","","",{"$f":"IF(V78>0,COUNTIF(Q$7:Q78,\"=\"&Q78)-1,\"\")","v":""},"",0,0,0,0,0,0,0,0,0,0,0,0,0,0,0,0,0,0,0,0,0,0,0,0,0,0,0,0,0,0,0,0,0,0,0,0,0,0,0,0,0,0,0,0,0,0,0,0,0,0,0,0,0,0,0,0,0,0,0,0,0,0,0,0,0,0,0,0,0,0,0,0,0,0,0,0,0,0,0,null,1,0,0,"","p","p",0]
["",0,0,0,0,null,null,null,null,null,"",{"$error":"#VALUE!"},"",{"$error":"#VALUE!"},"",{"$error":"#VALUE!"},"","","",{"$f":"IF(V79>0,COUNTIF(Q$7:Q79,\"=\"&Q79)-1,\"\")","v":""},"",0,0,0,0,0,0,0,0,0,0,0,0,0,0,0,0,0,0,0,0,0,0,0,0,0,0,0,0,0,0,0,0,0,0,0,0,0,0,0,0,0,0,0,0,0,0,0,0,0,0,0,0,0,0,0,0,0,0,0,0,0,0,0,0,0,0,0,0,0,0,0,0,0,0,0,0,0,0,0,null,1,0,0,"","p","p",0]
["",0,0,0,0,null,null,null,null,null,"",{"$error":"#VALUE!"},"",{"$error":"#VALUE!"},"",{"$error":"#VALUE!"},"","","",{"$f":"IF(V80>0,COUNTIF(Q$7:Q80,\"=\"&Q80)-1,\"\")","v":""},"",0,0,0,0,0,0,0,0,0,0,0,0,0,0,0,0,0,0,0,0,0,0,0,0,0,0,0,0,0,0,0,0,0,0,0,0,0,0,0,0,0,0,0,0,0,0,0,0,0,0,0,0,0,0,0,0,0,0,0,0,0,0,0,0,0,0,0,0,0,0,0,0,0,0,0,0,0,0,0,null,1,0,0,"","p","p",0]
["",0,0,0,0,null,null,null,null,null,"",{"$error":"#VALUE!"},"",{"$error":"#VALUE!"},"",{"$error":"#VALUE!"},"","","",{"$f":"IF(V81>0,COUNTIF(Q$7:Q81,\"=\"&Q81)-1,\"\")","v":""},"",0,0,0,0,0,0,0,0,0,0,0,0,0,0,0,0,0,0,0,0,0,0,0,0,0,0,0,0,0,0,0,0,0,0,0,0,0,0,0,0,0,0,0,0,0,0,0,0,0,0,0,0,0,0,0,0,0,0,0,0,0,0,0,0,0,0,0,0,0,0,0,0,0,0,0,0,0,0,0,null,1,0,0,"","p","p",0]
["",0,0,0,0,null,null,null,null,null,"",{"$error":"#VALUE!"},"",{"$error":"#VALUE!"},"",{"$error":"#VALUE!"},"","","",{"$f":"IF(V82>0,COUNTIF(Q$7:Q82,\"=\"&Q82)-1,\"\")","v":""},"",0,0,0,0,0,0,0,0,0,0,0,0,0,0,0,0,0,0,0,0,0,0,0,0,0,0,0,0,0,0,0,0,0,0,0,0,0,0,0,0,0,0,0,0,0,0,0,0,0,0,0,0,0,0,0,0,0,0,0,0,0,0,0,0,0,0,0,0,0,0,0,0,0,0,0,0,0,0,0,null,1,0,0,"","p","p",0]
["",0,0,0,0,null,null,null,null,null,"",{"$error":"#VALUE!"},"",{"$error":"#VALUE!"},"",{"$error":"#VALUE!"},"","","",{"$f":"IF(V83>0,COUNTIF(Q$7:Q83,\"=\"&Q83)-1,\"\")","v":""},"",0,0,0,0,0,0,0,0,0,0,0,0,0,0,0,0,0,0,0,0,0,0,0,0,0,0,0,0,0,0,0,0,0,0,0,0,0,0,0,0,0,0,0,0,0,0,0,0,0,0,0,0,0,0,0,0,0,0,0,0,0,0,0,0,0,0,0,0,0,0,0,0,0,0,0,0,0,0,0,null,1,0,0,"","p","p",0]
["",0,0,0,0,null,null,null,null,null,"",{"$error":"#VALUE!"},"",{"$error":"#VALUE!"},"",{"$error":"#VALUE!"},"","","",{"$f":"IF(V84>0,COUNTIF(Q$7:Q84,\"=\"&Q84)-1,\"\")","v":""},"",0,0,0,0,0,0,0,0,0,0,0,0,0,0,0,0,0,0,0,0,0,0,0,0,0,0,0,0,0,0,0,0,0,0,0,0,0,0,0,0,0,0,0,0,0,0,0,0,0,0,0,0,0,0,0,0,0,0,0,0,0,0,0,0,0,0,0,0,0,0,0,0,0,0,0,0,0,0,0,null,1,0,0,"","p","p",0]
["",0,0,0,0,null,null,null,null,null,"",{"$error":"#VALUE!"},"",{"$error":"#VALUE!"},"",{"$error":"#VALUE!"},"","","",{"$f":"IF(V85>0,COUNTIF(Q$7:Q85,\"=\"&Q85)-1,\"\")","v":""},"",0,0,0,0,0,0,0,0,0,0,0,0,0,0,0,0,0,0,0,0,0,0,0,0,0,0,0,0,0,0,0,0,0,0,0,0,0,0,0,0,0,0,0,0,0,0,0,0,0,0,0,0,0,0,0,0,0,0,0,0,0,0,0,0,0,0,0,0,0,0,0,0,0,0,0,0,0,0,0,null,1,0,0,"","p","p",0]
["",0,0,0,0,null,null,null,null,null,"",{"$error":"#VALUE!"},"",{"$error":"#VALUE!"},"",{"$error":"#VALUE!"},"","","",{"$f":"IF(V86>0,COUNTIF(Q$7:Q86,\"=\"&Q86)-1,\"\")","v":""},"",0,0,0,0,0,0,0,0,0,0,0,0,0,0,0,0,0,0,0,0,0,0,0,0,0,0,0,0,0,0,0,0,0,0,0,0,0,0,0,0,0,0,0,0,0,0,0,0,0,0,0,0,0,0,0,0,0,0,0,0,0,0,0,0,0,0,0,0,0,0,0,0,0,0,0,0,0,0,0,null,1,0,0,"","p","p",0]
["",0,0,0,0,null,null,null,null,null,"",{"$error":"#VALUE!"},"",{"$error":"#VALUE!"},"",{"$error":"#VALUE!"},"","","",{"$f":"IF(V87>0,COUNTIF(Q$7:Q87,\"=\"&Q87)-1,\"\")","v":""},"",0,{"$f":"$V87-LEN(SUBSTITUTE($J87,W$4,\"\"))","v":0},0,0,0,0,{"$f":"IF($CZ87>0,$V87-LEN(SUBSTITUTE($J87,AB$4,\"\")),0)","v":0},0,0,0,0,0,0,0,0,0,{"$f":"IF($CZ87>0,$V87-LEN(SUBSTITUTE($J87,AL$4,\"\")),0)","v":0},0,0,0,0,0,0,0,0,0,{"$f":"IF($CZ87>0,$V87-LEN(SUBSTITUTE($J87,AV$4,\"\")),0)","v":0},0,0,0,0,0,0,0,0,0,0,0,0,{"$f":"IF($CZ87>0,$V87-LEN(SUBSTITUTE($J87,BI$4,\"\")),0)","v":0},0,0,0,0,0,0,0,0,0,{"$f":"IF($CZ87>0,$V87-LEN(SUBSTITUTE($J87,BS$4,\"\")),0)","v":0},0,0,0,0,0,0,0,0,0,{"$f":"IF($CZ87>0,$V87-LEN(SUBSTITUTE($J87,CC$4,\"\")),0)","v":0},0,0,0,0,0,0,0,0,0,0,{"$f":"IF($CZ87>0,$V87-LEN(SUBSTITUTE($J87,CN$4,\"\")),0)","v":0},0,0,0,{"$f":"IF($CZ87>0,$V87-LEN(SUBSTITUTE($J87,CR$4,\"\")),0)","v":0},0,0,0,0,null,1,0,0,"","p","p",0]
["",0,0,0,0,null,null,null,null,null,"",{"$error":"#VALUE!"},"",{"$error":"#VALUE!"},"",{"$error":"#VALUE!"},"","","",{"$f":"IF(V88>0,COUNTIF(Q$7:Q88,\"=\"&Q88)-1,\"\")","v":""},"",0,0,0,0,0,0,0,0,0,0,0,0,0,0,0,0,0,0,0,0,0,0,0,0,0,0,0,0,0,0,0,0,0,0,0,0,0,0,0,0,0,0,0,0,0,0,0,0,0,0,0,0,0,0,0,0,0,0,0,0,0,0,0,0,0,0,0,0,0,0,0,0,0,0,0,0,0,0,0,null,1,0,0,"","p","p",0]
["",0,0,0,0,null,null,null,null,null,"",{"$error":"#VALUE!"},"",{"$error":"#VALUE!"},"",{"$error":"#VALUE!"},"","","",{"$f":"IF(V89>0,COUNTIF(Q$7:Q89,\"=\"&Q89)-1,\"\")","v":""},"",0,0,0,0,0,0,0,0,0,0,0,0,0,0,0,0,0,0,0,0,0,0,0,0,0,0,0,0,0,0,0,0,0,0,0,0,0,0,0,0,0,0,0,0,0,0,0,0,0,0,0,0,0,0,0,0,0,0,0,0,0,0,0,0,0,0,0,0,0,0,0,0,0,0,0,0,0,0,0,null,1,0,0,"","p","p",0]
["",0,0,0,0,null,null,null,null,null,"",{"$error":"#VALUE!"},"",{"$error":"#VALUE!"},"",{"$error":"#VALUE!"},"","","",{"$f":"IF(V90>0,COUNTIF(Q$7:Q90,\"=\"&Q90)-1,\"\")","v":""},"",0,0,0,0,0,0,0,0,0,0,0,0,0,0,0,0,0,0,0,0,0,0,0,0,0,0,0,0,0,0,0,0,0,0,0,0,0,0,0,0,0,0,0,0,0,0,0,0,0,0,0,0,0,0,0,0,0,0,0,0,0,0,0,0,0,0,0,0,0,0,0,0,0,0,0,0,0,0,0,null,1,0,0,"","p","p",0]
["",0,0,0,0,null,null,null,null,null,"",{"$error":"#VALUE!"},"",{"$error":"#VALUE!"},"",{"$error":"#VALUE!"},"","","",{"$f":"IF(V91>0,COUNTIF(Q$7:Q91,\"=\"&Q91)-1,\"\")","v":""},"",0,0,0,0,0,0,0,0,0,0,0,0,0,0,0,0,0,0,0,0,0,0,0,0,0,0,0,0,0,0,0,0,0,0,0,0,0,0,0,0,0,0,0,0,0,0,0,0,0,0,0,0,0,0,0,0,0,0,0,0,0,0,0,0,0,0,0,0,0,0,0,0,0,0,0,0,0,0,0,null,1,0,0,"","p","p",0]
["",0,0,0,0,null,null,null,null,null,"",{"$error":"#VALUE!"},"",{"$error":"#VALUE!"},"",{"$error":"#VALUE!"},"","","",{"$f":"IF(V92>0,COUNTIF(Q$7:Q92,\"=\"&Q92)-1,\"\")","v":""},"",0,0,0,0,0,0,0,0,0,0,0,0,0,0,0,0,0,0,0,0,0,0,0,0,0,0,0,0,0,0,0,0,0,0,0,0,0,0,0,0,0,0,0,0,0,0,0,0,0,0,0,0,0,0,0,0,0,0,0,0,0,0,0,0,0,0,0,0,0,0,0,0,0,0,0,0,0,0,0,null,1,0,0,"","p","p",0]
["",0,0,0,0,null,null,null,null,null,"",{"$error":"#VALUE!"},"",{"$error":"#VALUE!"},"",{"$error":"#VALUE!"},"","","",{"$f":"IF(V93>0,COUNTIF(Q$7:Q93,\"=\"&Q93)-1,\"\")","v":""},"",0,0,0,0,0,0,0,0,0,0,0,0,0,0,0,0,0,0,0,0,0,0,0,0,0,0,0,0,0,0,0,0,0,0,0,0,0,0,0,0,0,0,0,0,0,0,0,0,0,0,0,0,0,0,0,0,0,0,0,0,0,0,0,0,0,0,0,0,0,0,0,0,0,0,0,0,0,0,0,null,1,0,0,"","p","p",0]
["",0,0,0,0,null,null,null,null,null,"",{"$error":"#VALUE!"},"",{"$error":"#VALUE!"},"",{"$error":"#VALUE!"},"","","",{"$f":"IF(V94>0,COUNTIF(Q$7:Q94,\"=\"&Q94)-1,\"\")","v":""},"",0,0,0,0,0,0,0,0,0,0,0,0,0,0,0,0,0,0,0,0,0,0,0,0,0,0,0,0,0,0,0,0,0,0,0,0,0,0,0,0,0,0,0,0,0,0,0,0,0,0,0,0,0,0,0,0,0,0,0,0,0,0,0,0,0,0,0,0,0,0,0,0,0,0,0,0,0,0,0,null,1,0,0,"","p","p",0]
["",0,0,0,0,null,null,null,null,null,"",{"$error":"#VALUE!"},"",{"$error":"#VALUE!"},"",{"$error":"#VALUE!"},"","","",{"$f":"IF(V95>0,COUNTIF(Q$7:Q95,\"=\"&Q95)-1,\"\")","v":""},"",0,0,0,0,0,0,0,0,0,0,0,0,0,0,0,0,0,0,0,0,0,0,0,0,0,0,0,0,0,0,0,0,0,0,0,0,0,0,0,0,0,0,0,0,0,0,0,0,0,0,0,0,0,0,0,0,0,0,0,0,0,0,0,0,0,0,0,0,0,0,0,0,0,0,0,0,0,0,0,null,1,0,0,"","p","p",0]
["",0,0,0,0,null,null,null,null,null,"",{"$error":"#VALUE!"},"",{"$error":"#VALUE!"},"",{"$error":"#VALUE!"},"","","",{"$f":"IF(V96>0,COUNTIF(Q$7:Q96,\"=\"&Q96)-1,\"\")","v":""},"",0,0,0,0,0,0,0,0,0,0,0,0,0,0,0,0,0,0,0,0,0,0,0,0,0,0,0,0,0,0,0,0,0,0,0,0,0,0,0,0,0,0,0,0,0,0,0,0,0,0,0,0,0,0,0,0,0,0,0,0,0,0,0,0,0,0,0,0,0,0,0,0,0,0,0,0,0,0,0,null,1,0,0,"","p","p",0]
["",0,0,0,0,null,null,null,null,null,"",{"$error":"#VALUE!"},"",{"$error":"#VALUE!"},"",{"$error":"#VALUE!"},"","","",{"$f":"IF(V97>0,COUNTIF(Q$7:Q97,\"=\"&Q97)-1,\"\")","v":""},"",0,{"$f":"$V97-LEN(SUBSTITUTE($J97,W$4,\"\"))","v":0},0,0,0,0,{"$f":"IF($CZ97>0,$V97-LEN(SUBSTITUTE($J97,AB$4,\"\")),0)","v":0},0,0,0,0,0,0,0,0,0,{"$f":"IF($CZ97>0,$V97-LEN(SUBSTITUTE($J97,AL$4,\"\")),0)","v":0},0,0,0,0,0,0,0,0,0,{"$f":"IF($CZ97>0,$V97-LEN(SUBSTITUTE($J97,AV$4,\"\")),0)","v":0},0,0,0,0,0,0,0,0,0,0,0,0,{"$f":"IF($CZ97>0,$V97-LEN(SUBSTITUTE($J97,BI$4,\"\")),0)","v":0},0,0,0,0,0,0,0,0,0,{"$f":"IF($CZ97>0,$V97-LEN(SUBSTITUTE($J97,BS$4,\"\")),0)","v":0},0,0,0,0,0,0,0,0,0,{"$f":"IF($CZ97>0,$V97-LEN(SUBSTITUTE($J97,CC$4,\"\")),0)","v":0},0,0,0,0,0,0,0,0,0,0,0,0,0,0,0,0,0,0,0,null,1,0,0,"","p","p",0]
["",0,0,0,0,null,null,null,null,null,"",{"$error":"#VALUE!"},"",{"$error":"#VALUE!"},"",{"$error":"#VALUE!"},"","","",{"$f":"IF(V98>0,COUNTIF(Q$7:Q98,\"=\"&Q98)-1,\"\")","v":""},"",0,0,0,0,0,0,0,0,0,0,0,0,0,0,0,0,0,0,0,0,0,0,0,0,0,0,0,0,0,0,0,0,0,0,0,0,0,0,0,0,0,0,0,0,0,0,0,0,0,0,0,0,0,0,0,0,0,0,0,0,0,0,0,0,0,0,0,0,0,0,0,0,0,0,0,0,0,0,0,null,1,0,0,"","p","p",0]
["",0,0,0,0,null,null,null,null,null,"",{"$error":"#VALUE!"},"",{"$error":"#VALUE!"},"",{"$error":"#VALUE!"},"","","",{"$f":"IF(V99>0,COUNTIF(Q$7:Q99,\"=\"&Q99)-1,\"\")","v":""},"",0,0,0,0,0,0,0,0,0,0,0,0,0,0,0,0,0,0,0,0,0,0,0,0,0,0,0,0,0,0,0,0,0,0,0,0,0,0,0,0,0,0,0,0,0,0,0,0,0,0,0,0,0,0,0,0,0,0,0,0,0,0,0,0,0,0,0,0,0,0,0,0,0,0,0,0,0,0,0,null,1,0,0,"","p","p",0]
["",0,0,0,0,null,null,null,null,null,"",{"$error":"#VALUE!"},"",{"$error":"#VALUE!"},"",{"$error":"#VALUE!"},"","","",{"$f":"IF(V100>0,COUNTIF(Q$7:Q100,\"=\"&Q100)-1,\"\")","v":""},"",0,0,0,0,0,0,0,0,0,0,0,0,0,0,0,0,0,0,0,0,0,0,0,0,0,0,0,0,0,0,0,0,0,0,0,0,0,0,0,0,0,0,0,0,0,0,0,0,0,0,0,0,0,0,0,0,0,0,0,0,0,0,0,0,0,0,0,0,0,0,0,0,0,0,0,0,0,0,0,null,1,0,0,"","p","p",0]
["",0,0,0,0,null,null,null,null,null,"",{"$error":"#VALUE!"},"",{"$error":"#VALUE!"},"",{"$error":"#VALUE!"},"","","",{"$f":"IF(V101>0,COUNTIF(Q$7:Q101,\"=\"&Q101)-1,\"\")","v":""},"",0,0,0,0,0,0,0,0,0,0,0,0,0,0,0,0,0,0,0,0,0,0,0,0,0,0,0,0,0,0,0,0,0,0,0,0,0,0,0,0,0,0,0,0,0,0,0,0,0,0,0,0,0,0,0,0,0,0,0,0,0,0,0,0,0,0,0,0,0,0,0,0,0,0,0,0,0,0,0,null,1,0,0,"","p","p",0]
["",0,0,0,0,null,null,null,null,null,"",{"$error":"#VALUE!"},"",{"$error":"#VALUE!"},"",{"$error":"#VALUE!"},"","","",{"$f":"IF(V102>0,COUNTIF(Q$7:Q102,\"=\"&Q102)-1,\"\")","v":""},"",0,0,0,0,0,0,0,0,0,0,0,0,0,0,0,0,0,0,0,0,0,0,0,0,0,0,0,0,0,0,0,0,0,0,0,0,0,0,0,0,0,0,0,0,0,0,0,0,0,0,0,0,0,0,0,0,0,0,0,0,0,0,0,0,0,0,0,0,0,0,0,0,0,0,0,0,0,0,0,null,1,0,0,"","p","p",0]
["",0,0,0,0,null,null,null,null,null,"",{"$error":"#VALUE!"},"",{"$error":"#VALUE!"},"",{"$error":"#VALUE!"},"","","",{"$f":"IF(V103>0,COUNTIF(Q$7:Q103,\"=\"&Q103)-1,\"\")","v":""},"",0,0,0,0,0,0,0,0,0,0,0,0,0,0,0,0,0,0,0,0,0,0,0,0,0,0,0,0,0,0,0,0,0,0,0,0,0,0,0,0,0,0,0,0,0,0,0,0,0,0,0,0,0,0,0,0,0,0,0,0,0,0,0,0,0,0,0,0,0,0,0,0,0,0,{"$f":"IF($CZ103>0,$V103-LEN(SUBSTITUTE($J103,CR$4,\"\")),0)","v":0},0,0,0,0,null,1,0,0,"","p","p",0]
["",0,0,0,0,null,null,null,null,null,"",{"$error":"#VALUE!"},"",{"$error":"#VALUE!"},"",{"$error":"#VALUE!"},"","","",{"$f":"IF(V104>0,COUNTIF(Q$7:Q104,\"=\"&Q104)-1,\"\")","v":""},"",0,0,0,0,0,0,0,0,0,0,0,0,0,0,0,0,0,0,0,0,0,0,0,0,0,0,0,0,0,0,0,0,0,0,0,0,0,0,0,0,0,0,0,0,0,0,0,0,0,0,0,0,0,0,0,0,0,0,0,0,0,0,0,0,0,0,0,0,0,0,0,0,0,0,0,0,0,0,0,null,1,0,0,"","p","p",0]
["",0,0,0,0,null,null,null,null,null,"",{"$error":"#VALUE!"},"",{"$error":"#VALUE!"},"",{"$error":"#VALUE!"},"","","",{"$f":"IF(V105>0,COUNTIF(Q$7:Q105,\"=\"&Q105)-1,\"\")","v":""},"",0,0,0,0,0,0,0,0,0,0,0,0,0,0,0,0,0,0,0,0,0,0,0,0,0,0,0,0,0,0,0,0,0,0,0,0,0,0,0,0,0,0,0,0,0,0,0,0,0,0,0,0,0,0,0,0,0,0,0,0,0,0,0,0,0,0,0,0,0,0,0,0,0,0,0,0,0,0,0,null,1,0,0,"","p","p",0]
["",0,0,0,0,null,null,null,null,null,"",{"$error":"#VALUE!"},"",{"$error":"#VALUE!"},"",{"$error":"#VALUE!"},"","","",{"$f":"IF(V106>0,COUNTIF(Q$7:Q106,\"=\"&Q106)-1,\"\")","v":""},"",0,0,0,0,0,0,0,0,0,0,0,0,0,0,0,0,0,0,0,0,0,0,0,0,0,0,0,0,0,0,0,0,0,0,0,0,0,0,0,0,0,0,0,0,0,0,0,0,0,0,0,0,0,0,0,0,0,0,0,0,0,0,0,0,0,0,0,0,0,0,0,0,0,0,0,0,0,0,0,null,1,0,0,"","p","p",0]
["",0,0,0,0,null,null,null,null,null,"",{"$error":"#VALUE!"},"",{"$error":"#VALUE!"},"",{"$error":"#VALUE!"},"","","",{"$f":"IF(V107>0,COUNTIF(Q$7:Q107,\"=\"&Q107)-1,\"\")","v":""},"",0,{"$f":"$V107-LEN(SUBSTITUTE($J107,W$4,\"\"))","v":0},0,0,0,0,{"$f":"IF($CZ107>0,$V107-LEN(SUBSTITUTE($J107,AB$4,\"\")),0)","v":0},0,0,0,0,0,0,0,0,0,{"$f":"IF($CZ107>0,$V107-LEN(SUBSTITUTE($J107,AL$4,\"\")),0)","v":0},0,0,0,0,0,0,0,0,0,{"$f":"IF($CZ107>0,$V107-LEN(SUBSTITUTE($J107,AV$4,\"\")),0)","v":0},0,0,0,0,0,0,0,0,0,0,0,0,{"$f":"IF($CZ107>0,$V107-LEN(SUBSTITUTE($J107,BI$4,\"\")),0)","v":0},0,0,0,0,0,0,0,0,0,{"$f":"IF($CZ107>0,$V107-LEN(SUBSTITUTE($J107,BS$4,\"\")),0)","v":0},0,0,0,0,0,0,0,0,0,{"$f":"IF($CZ107>0,$V107-LEN(SUBSTITUTE($J107,CC$4,\"\")),0)","v":0},0,0,0,0,0,0,0,0,0,0,{"$f":"IF($CZ107>0,$V107-LEN(SUBSTITUTE($J107,CN$4,\"\")),0)","v":0},0,0,0,0,0,0,0,0,null,1,0,0,"","p","p",0]
["",0,0,0,0,null,null,null,null,null,"",{"$error":"#VALUE!"},"",{"$error":"#VALUE!"},"",{"$error":"#VALUE!"},"","","",{"$f":"IF(V108>0,COUNTIF(Q$7:Q108,\"=\"&Q108)-1,\"\")","v":""},"",0,0,0,0,0,0,0,0,0,0,0,0,0,0,0,0,0,0,0,0,0,0,0,0,0,0,0,0,0,0,0,0,0,0,0,0,0,0,0,0,0,0,0,0,0,0,0,0,0,0,0,0,0,0,0,0,0,0,0,0,0,0,0,0,0,0,0,0,0,0,0,0,0,0,0,0,0,0,0,null,1,0,0,"","p","p",0]
["",0,0,0,0,null,null,null,null,null,"",{"$error":"#VALUE!"},"",{"$error":"#VALUE!"},"",{"$error":"#VALUE!"},"","","",{"$f":"IF(V109>0,COUNTIF(Q$7:Q109,\"=\"&Q109)-1,\"\")","v":""},"",0,0,0,0,0,0,0,0,0,0,0,0,0,0,0,0,0,0,0,0,0,0,0,0,0,0,0,0,0,0,0,0,0,0,0,0,0,0,0,0,0,0,0,0,0,0,0,0,0,0,0,0,0,0,0,0,0,0,0,0,0,0,0,0,0,0,0,0,0,0,0,0,0,0,0,0,0,0,0,null,1,0,0,"","p","p",0]
["",0,0,0,0,null,null,null,null,null,"",{"$error":"#VALUE!"},"",{"$error":"#VALUE!"},"",{"$error":"#VALUE!"},"","","",{"$f":"IF(V110>0,COUNTIF(Q$7:Q110,\"=\"&Q110)-1,\"\")","v":""},"",0,0,0,0,0,0,0,0,0,0,0,0,0,0,0,0,0,0,0,0,0,0,0,0,0,0,0,0,0,0,0,0,0,0,0,0,0,0,0,0,0,0,0,0,0,0,0,0,0,0,0,0,0,0,0,0,0,0,0,0,0,0,0,0,0,0,0,0,0,0,0,0,0,0,0,0,0,0,0,null,1,0,0,"","p","p",0]
["",0,0,0,0,null,null,null,null,null,"",{"$error":"#VALUE!"},"",{"$error":"#VALUE!"},"",{"$error":"#VALUE!"},"","","",{"$f":"IF(V111>0,COUNTIF(Q$7:Q111,\"=\"&Q111)-1,\"\")","v":""},"",0,0,0,0,0,0,0,0,0,0,0,0,0,0,0,0,0,0,0,0,0,0,0,0,0,0,0,0,0,0,0,0,0,0,0,0,0,0,0,0,0,0,0,0,0,0,0,0,0,0,0,0,0,0,0,0,0,0,0,0,0,0,0,0,0,0,0,0,0,0,0,0,0,0,0,0,0,0,0,null,1,0,0,"","p","p",0]
["",0,0,0,0,null,null,null,null,null,"",{"$error":"#VALUE!"},"",{"$error":"#VALUE!"},"",{"$error":"#VALUE!"},"","","",{"$f":"IF(V112>0,COUNTIF(Q$7:Q112,\"=\"&Q112)-1,\"\")","v":""},"",0,0,0,0,0,0,0,0,0,0,0,0,0,0,0,0,0,0,0,0,0,0,0,0,0,0,0,0,0,0,0,0,0,0,0,0,0,0,0,0,0,0,0,0,0,0,0,0,0,0,0,0,0,0,0,0,0,0,0,0,0,0,0,0,0,0,0,0,0,0,0,0,0,0,0,0,0,0,0,null,1,0,0,"","p","p",0]
["",0,0,0,0,null,null,null,null,null,"",{"$error":"#VALUE!"},"",{"$error":"#VALUE!"},"",{"$error":"#VALUE!"},"","","",{"$f":"IF(V113>0,COUNTIF(Q$7:Q113,\"=\"&Q113)-1,\"\")","v":""},"",0,0,0,0,0,0,0,0,0,0,0,0,0,0,0,0,0,0,0,0,0,0,0,0,0,0,0,0,0,0,0,0,0,0,0,0,0,0,0,0,0,0,0,0,0,0,0,0,0,0,0,0,0,0,0,0,0,0,0,0,0,0,0,0,0,0,0,0,0,0,0,0,0,0,0,0,0,0,0,null,1,0,0,"","p","p",0]
["",0,0,0,0,null,null,null,null,null,"",{"$error":"#VALUE!"},"",{"$error":"#VALUE!"},"",{"$error":"#VALUE!"},"","","",{"$f":"IF(V114>0,COUNTIF(Q$7:Q114,\"=\"&Q114)-1,\"\")","v":""},"",0,0,0,0,0,0,0,0,0,0,0,0,0,0,0,0,0,0,0,0,0,0,0,0,0,0,0,0,0,0,0,0,0,0,0,0,0,0,0,0,0,0,0,0,0,0,0,0,0,0,0,0,0,0,0,0,0,0,0,0,0,0,0,0,0,0,0,0,0,0,0,0,0,0,0,0,0,0,0,null,1,0,0,"","p","p",0]
["",0,0,0,0,null,null,null,null,null,"",{"$error":"#VALUE!"},"",{"$error":"#VALUE!"},"",{"$error":"#VALUE!"},"","","",{"$f":"IF(V115>0,COUNTIF(Q$7:Q115,\"=\"&Q115)-1,\"\")","v":""},"",0,0,0,0,0,0,0,0,0,0,0,0,0,0,0,0,0,0,0,0,0,0,0,0,0,0,0,0,0,0,0,0,0,0,0,0,0,0,0,0,0,0,0,0,0,0,0,0,0,0,0,0,0,0,0,0,0,0,0,0,0,0,0,0,0,0,0,0,0,0,0,0,0,0,0,0,0,0,0,null,1,0,0,"","p","p",0]
["",0,0,0,0,null,null,null,null,null,"",{"$error":"#VALUE!"},"",{"$error":"#VALUE!"},"",{"$error":"#VALUE!"},"","","",{"$f":"IF(V116>0,COUNTIF(Q$7:Q116,\"=\"&Q116)-1,\"\")","v":""},"",0,0,0,0,0,0,0,0,0,0,0,0,0,0,0,0,0,0,0,0,0,0,0,0,0,0,0,0,0,0,0,0,0,0,0,0,0,0,0,0,0,0,0,0,0,0,0,0,0,0,0,0,0,0,0,0,0,0,0,0,0,0,0,0,0,0,0,0,0,0,0,0,0,0,0,0,0,0,0,null,1,0,0,"","p","p",0]
["",0,0,0,0,null,null,null,null,null,"",{"$error":"#VALUE!"},"",{"$error":"#VALUE!"},"",{"$error":"#VALUE!"},"","","",{"$f":"IF(V117>0,COUNTIF(Q$7:Q117,\"=\"&Q117)-1,\"\")","v":""},"",0,{"$f":"$V117-LEN(SUBSTITUTE($J117,W$4,\"\"))","v":0},0,0,0,0,{"$f":"IF($CZ117>0,$V117-LEN(SUBSTITUTE($J117,AB$4,\"\")),0)","v":0},0,0,0,0,0,0,0,0,0,{"$f":"IF($CZ117>0,$V117-LEN(SUBSTITUTE($J117,AL$4,\"\")),0)","v":0},0,0,0,0,0,0,0,0,0,{"$f":"IF($CZ117>0,$V117-LEN(SUBSTITUTE($J117,AV$4,\"\")),0)","v":0},0,0,0,0,0,0,0,0,0,0,0,0,{"$f":"IF($CZ117>0,$V117-LEN(SUBSTITUTE($J117,BI$4,\"\")),0)","v":0},0,0,0,0,0,0,0,0,0,{"$f":"IF($CZ117>0,$V117-LEN(SUBSTITUTE($J117,BS$4,\"\")),0)","v":0},0,0,0,0,0,0,0,0,0,{"$f":"IF($CZ117>0,$V117-LEN(SUBSTITUTE($J117,CC$4,\"\")),0)","v":0},0,0,0,0,0,0,0,0,0,0,0,0,0,0,0,0,0,0,0,null,1,0,0,"","p","p",0]
["",0,0,0,0,null,null,null,null,null,"",{"$error":"#VALUE!"},"",{"$error":"#VALUE!"},"",{"$error":"#VALUE!"},"","","",{"$f":"IF(V118>0,COUNTIF(Q$7:Q118,\"=\"&Q118)-1,\"\")","v":""},"",0,0,0,0,0,0,0,0,0,0,0,0,0,0,0,0,0,0,0,0,0,0,0,0,0,0,0,0,0,0,0,0,0,0,0,0,0,0,0,0,0,0,0,0,0,0,0,0,0,0,0,0,0,0,0,0,0,0,0,0,0,0,0,0,0,0,0,0,0,0,0,0,0,0,0,0,0,0,0,null,1,0,0,"","p","p",0]
["",0,0,0,0,null,null,null,null,null,"",{"$error":"#VALUE!"},"",{"$error":"#VALUE!"},"",{"$error":"#VALUE!"},"","","",{"$f":"IF(V119>0,COUNTIF(Q$7:Q119,\"=\"&Q119)-1,\"\")","v":""},"",0,0,0,0,0,0,0,0,0,0,0,0,0,0,0,0,0,0,0,0,0,0,0,0,0,0,0,0,0,0,0,0,0,0,0,0,0,0,0,0,0,0,0,0,0,0,0,0,0,0,0,0,0,0,0,0,0,0,0,0,0,0,0,0,0,0,0,0,0,0,0,0,0,0,{"$f":"IF($CZ119>0,$V119-LEN(SUBSTITUTE($J119,CR$4,\"\")),0)","v":0},0,0,0,0,null,1,0,0,"","p","p",0]
["",0,0,0,0,null,null,null,null,null,"",{"$error":"#VALUE!"},"",{"$error":"#VALUE!"},"",{"$error":"#VALUE!"},"","","",{"$f":"IF(V120>0,COUNTIF(Q$7:Q120,\"=\"&Q120)-1,\"\")","v":""},"",0,0,0,0,0,0,0,0,0,0,0,0,0,0,0,0,0,0,0,0,0,0,0,0,0,0,0,0,0,0,0,0,0,0,0,0,0,0,0,0,0,0,0,0,0,0,0,0,0,0,0,0,0,0,0,0,0,0,0,0,0,0,0,0,0,0,0,0,0,0,0,0,0,0,0,0,0,0,0,null,1,0,0,"","p","p",0]
["",0,0,0,0,null,null,null,null,null,"",{"$error":"#VALUE!"},"",{"$error":"#VALUE!"},"",{"$error":"#VALUE!"},"","","",{"$f":"IF(V121>0,COUNTIF(Q$7:Q121,\"=\"&Q121)-1,\"\")","v":""},"",0,0,0,0,0,0,0,0,0,0,0,0,0,0,0,0,0,0,0,0,0,0,0,0,0,0,0,0,0,0,0,0,0,0,0,0,0,0,0,0,0,0,0,0,0,0,0,0,0,0,0,0,0,0,0,0,0,0,0,0,0,0,0,0,0,0,0,0,0,0,0,0,0,0,0,0,0,0,0,null,1,0,0,"","p","p",0]
["",0,0,0,0,null,null,null,null,null,"",{"$error":"#VALUE!"},"",{"$error":"#VALUE!"},"",{"$error":"#VALUE!"},"","","",{"$f":"IF(V122>0,COUNTIF(Q$7:Q122,\"=\"&Q122)-1,\"\")","v":""},"",0,0,0,0,0,0,0,0,0,0,0,0,0,0,0,0,0,0,0,0,0,0,0,0,0,0,0,0,0,0,0,0,0,0,0,0,0,0,0,0,0,0,0,0,0,0,0,0,0,0,0,0,0,0,0,0,0,0,0,0,0,0,0,0,0,0,0,0,0,0,0,0,0,0,0,0,0,0,0,null,1,0,0,"","p","p",0]
["",0,0,0,0,null,null,null,null,null,"",{"$error":"#VALUE!"},"",{"$error":"#VALUE!"},"",{"$error":"#VALUE!"},"","","",{"$f":"IF(V123>0,COUNTIF(Q$7:Q123,\"=\"&Q123)-1,\"\")","v":""},"",0,0,0,0,0,0,0,0,0,0,0,0,0,0,0,0,0,0,0,0,0,0,0,0,0,0,0,0,0,0,0,0,0,0,0,0,0,0,0,0,0,0,0,0,0,0,0,0,0,0,0,0,0,0,0,0,0,0,0,0,0,0,0,0,0,0,0,0,0,0,0,0,0,0,0,0,0,0,0,null,1,0,0,"","p","p",0]
["",0,0,0,0,null,null,null,null,null,"",{"$error":"#VALUE!"},"",{"$error":"#VALUE!"},"",{"$error":"#VALUE!"},"","","",{"$f":"IF(V124>0,COUNTIF(Q$7:Q124,\"=\"&Q124)-1,\"\")","v":""},"",0,0,0,0,0,0,0,0,0,0,0,0,0,0,0,0,0,0,0,0,0,0,0,0,0,0,0,0,0,0,0,0,0,0,0,0,0,0,0,0,0,0,0,0,0,0,0,0,0,0,0,0,0,0,0,0,0,0,0,0,0,0,0,0,0,0,0,0,0,0,0,0,0,0,0,0,0,0,0,null,1,0,0,"","p","p",0]
["",0,0,0,0,null,null,null,null,null,"",{"$error":"#VALUE!"},"",{"$error":"#VALUE!"},"",{"$error":"#VALUE!"},"","","",{"$f":"IF(V125>0,COUNTIF(Q$7:Q125,\"=\"&Q125)-1,\"\")","v":""},"",0,0,0,0,0,0,0,0,0,0,0,0,0,0,0,0,0,0,0,0,0,0,0,0,0,0,0,0,0,0,0,0,0,0,0,0,0,0,0,0,0,0,0,0,0,0,0,0,0,0,0,0,0,0,0,0,0,0,0,0,0,0,0,0,0,0,0,0,0,0,0,0,0,0,0,0,0,0,0,null,1,0,0,"","p","p",0]
["",0,0,0,0,null,null,null,null,null,"",{"$error":"#VALUE!"},"",{"$error":"#VALUE!"},"",{"$error":"#VALUE!"},"","","",{"$f":"IF(V126>0,COUNTIF(Q$7:Q126,\"=\"&Q126)-1,\"\")","v":""},"",0,0,0,0,0,0,0,0,0,0,0,0,0,0,0,0,0,0,0,0,0,0,0,0,0,0,0,0,0,0,0,0,0,0,0,0,0,0,0,0,0,0,0,0,0,0,0,0,0,0,0,0,0,0,0,0,0,0,0,0,0,0,0,0,0,0,0,0,0,0,0,0,0,0,0,0,0,0,0,null,1,0,0,"","p","p",0]
["",0,0,0,0,null,null,null,null,null,"",{"$error":"#VALUE!"},"",{"$error":"#VALUE!"},"",{"$error":"#VALUE!"},"","","",{"$f":"IF(V127>0,COUNTIF(Q$7:Q127,\"=\"&Q127)-1,\"\")","v":""},"",0,{"$f":"$V127-LEN(SUBSTITUTE($J127,W$4,\"\"))","v":0},0,0,0,0,{"$f":"IF($CZ127>0,$V127-LEN(SUBSTITUTE($J127,AB$4,\"\")),0)","v":0},0,0,0,0,0,0,0,0,0,{"$f":"IF($CZ127>0,$V127-LEN(SUBSTITUTE($J127,AL$4,\"\")),0)","v":0},0,0,0,0,0,0,0,0,0,{"$f":"IF($CZ127>0,$V127-LEN(SUBSTITUTE($J127,AV$4,\"\")),0)","v":0},0,0,0,0,0,0,0,0,0,0,0,0,{"$f":"IF($CZ127>0,$V127-LEN(SUBSTITUTE($J127,BI$4,\"\")),0)","v":0},0,0,0,0,0,0,0,0,0,{"$f":"IF($CZ127>0,$V127-LEN(SUBSTITUTE($J127,BS$4,\"\")),0)","v":0},0,0,0,0,0,0,0,0,0,{"$f":"IF($CZ127>0,$V127-LEN(SUBSTITUTE($J127,CC$4,\"\")),0)","v":0},0,0,0,0,0,0,0,0,0,0,{"$f":"IF($CZ127>0,$V127-LEN(SUBSTITUTE($J127,CN$4,\"\")),0)","v":0},0,0,0,0,0,0,0,0,null,1,0,0,"","p","p",0]
["",0,0,0,0,null,null,null,null,null,"",{"$error":"#VALUE!"},"",{"$error":"#VALUE!"},"",{"$error":"#VALUE!"},"","","",{"$f":"IF(V128>0,COUNTIF(Q$7:Q128,\"=\"&Q128)-1,\"\")","v":""},"",0,0,0,0,0,0,0,0,0,0,0,0,0,0,0,0,0,0,0,0,0,0,0,0,0,0,0,0,0,0,0,0,0,0,0,0,0,0,0,0,0,0,0,0,0,0,0,0,0,0,0,0,0,0,0,0,0,0,0,0,0,0,0,0,0,0,0,0,0,0,0,0,0,0,0,0,0,0,0,null,1,0,0,"","p","p",0]
["",0,0,0,0,null,null,null,null,null,"",{"$error":"#VALUE!"},"",{"$error":"#VALUE!"},"",{"$error":"#VALUE!"},"","","",{"$f":"IF(V129>0,COUNTIF(Q$7:Q129,\"=\"&Q129)-1,\"\")","v":""},"",0,0,0,0,0,0,0,0,0,0,0,0,0,0,0,0,0,0,0,0,0,0,0,0,0,0,0,0,0,0,0,0,0,0,0,0,0,0,0,0,0,0,0,0,0,0,0,0,0,0,0,0,0,0,0,0,0,0,0,0,0,0,0,0,0,0,0,0,0,0,0,0,0,0,0,0,0,0,0,null,1,0,0,"","p","p",0]
["",0,0,0,0,null,null,null,null,null,"",{"$error":"#VALUE!"},"",{"$error":"#VALUE!"},"",{"$error":"#VALUE!"},"","","",{"$f":"IF(V130>0,COUNTIF(Q$7:Q130,\"=\"&Q130)-1,\"\")","v":""},"",0,0,0,0,0,0,0,0,0,0,0,0,0,0,0,0,0,0,0,0,0,0,0,0,0,0,0,0,0,0,0,0,0,0,0,0,0,0,0,0,0,0,0,0,0,0,0,0,0,0,0,0,0,0,0,0,0,0,0,0,0,0,0,0,0,0,0,0,0,0,0,0,0,0,0,0,0,0,0,null,1,0,0,"","p","p",0]
["",0,0,0,0,null,null,null,null,null,"",{"$error":"#VALUE!"},"",{"$error":"#VALUE!"},"",{"$error":"#VALUE!"},"","","",{"$f":"IF(V131>0,COUNTIF(Q$7:Q131,\"=\"&Q131)-1,\"\")","v":""},"",0,0,0,0,0,0,0,0,0,0,0,0,0,0,0,0,0,0,0,0,0,0,0,0,0,0,0,0,0,0,0,0,0,0,0,0,0,0,0,0,0,0,0,0,0,0,0,0,0,0,0,0,0,0,0,0,0,0,0,0,0,0,0,0,0,0,0,0,0,0,0,0,0,0,0,0,0,0,0,null,1,0,0,"","p","p",0]
["",0,0,0,0,null,null,null,null,null,"",{"$error":"#VALUE!"},"",{"$error":"#VALUE!"},"",{"$error":"#VALUE!"},"","","",{"$f":"IF(V132>0,COUNTIF(Q$7:Q132,\"=\"&Q132)-1,\"\")","v":""},"",0,0,0,0,0,0,0,0,0,0,0,0,0,0,0,0,0,0,0,0,0,0,0,0,0,0,0,0,0,0,0,0,0,0,0,0,0,0,0,0,0,0,0,0,0,0,0,0,0,0,0,0,0,0,0,0,0,0,0,0,0,0,0,0,0,0,0,0,0,0,0,0,0,0,0,0,0,0,0,null,1,0,0,"","p","p",0]
["",0,0,0,0,null,null,null,null,null,"",{"$error":"#VALUE!"},"",{"$error":"#VALUE!"},"",{"$error":"#VALUE!"},"","","",{"$f":"IF(V133>0,COUNTIF(Q$7:Q133,\"=\"&Q133)-1,\"\")","v":""},"",0,0,0,0,0,0,0,0,0,0,0,0,0,0,0,0,0,0,0,0,0,0,0,0,0,0,0,0,0,0,0,0,0,0,0,0,0,0,0,0,0,0,0,0,0,0,0,0,0,0,0,0,0,0,0,0,0,0,0,0,0,0,0,0,0,0,0,0,0,0,0,0,0,0,0,0,0,0,0,null,1,0,0,"","p","p",0]
["",0,0,0,0,null,null,null,null,null,"",{"$error":"#VALUE!"},"",{"$error":"#VALUE!"},"",{"$error":"#VALUE!"},"","","",{"$f":"IF(V134>0,COUNTIF(Q$7:Q134,\"=\"&Q134)-1,\"\")","v":""},"",0,0,0,0,0,0,0,0,0,0,0,0,0,0,0,0,0,0,0,0,0,0,0,0,0,0,0,0,0,0,0,0,0,0,0,0,0,0,0,0,0,0,0,0,0,0,0,0,0,0,0,0,0,0,0,0,0,0,0,0,0,0,0,0,0,0,0,0,0,0,0,0,0,0,0,0,0,0,0,null,1,0,0,"","p","p",0]
[{"$f":"IF(V135=0,\"\",A134+1)","v":""},0,{"$f":"IF($C$2=\"forced-OH\",-1,IF($G135=1,$C$3,IF($G135=2,$D$3,0)))","v":0},{"$f":"IF($F135=1,VLOOKUP($B$2,$DE$5:$DI$11,5,FALSE),0)","v":0},{"$f":"IF($F135=1,VLOOKUP($B$2,$DE$5:$DG$11,3,FALSE),0)","v":0},null,null,null,null,null,{"$f":"IF(V135=0,\"\",SUMPRODUCT(W$5:CY$5,W135:CY135))","v":""},{"$f":"IF(C135=-1,\"\",K135-18.01528)","v":{"$error":"#VALUE!"}},{"$f":"IF(V135=0,\"\",SUMPRODUCT(W$6:CY$6,W135:CY135))","v":""},{"$f":"IF(C135=-1,\"\",M135-18.0105646861)","v":{"$error":"#VALUE!"}},{"$f":"IF(V135=0,\"\",M135+TRUNC(K135-M135-0.1))","v":""},{"$f":"IF(C135=-1,\"\",O135-18.0105646861)","v":{"$error":"#VALUE!"}},{"$f":"IF(V135>0,ROUND(K135,4),\"\")","v":""},{"$f":"IF(V135>0,S135+T135,\"\")","v":""},{"$f":"IF(V135>0,COUNTIF(Q$7:Q$651,\"<\"&Q135)+1,\"\")","v":""},{"$f":"IF(V135>0,COUNTIF(Q$7:Q135,\"=\"&Q135)-1,\"\")","v":""},{"$f":"IF(V135>0,$R$6-R135+1,\"\")","v":""},{"$f":"LEN(J135)","v":0},0,0,0,0,0,0,0,0,0,0,0,0,0,0,0,0,0,0,0,0,0,0,0,0,0,0,0,0,0,0,0,0,0,0,0,0,0,{"$f":"IF($CZ135>0,$V135-LEN(SUBSTITUTE($J135,BH$4,\"\")),0)+DD135","v":0},0,0,0,0,0,0,0,0,0,0,0,0,0,0,0,0,0,0,0,0,0,0,0,0,0,0,0,0,0,0,0,0,0,0,0,{"$f":"IF($CZ135>0,$V135-LEN(SUBSTITUTE($J135,CR$4,\"\")),0)","v":0},0,0,0,{"$f":"V135+B135+C135","v":0},null,{"$f":"-(V135-1)+D135","v":1},{"$f":"E135","v":0},{"$f":"$V135-$W135-$X135-$Z135-$AA135","v":0},"",{"$f":"IF($C135=0,\"p\",\"\")","v":"p"},{"$f":"DA135&J135&DB135","v":"p"},{"$f":"IF($F135=1,VLOOKUP($B$2,$DE$5:$DH$11,4,FALSE),0)","v":0}]
["",{"$f":"IF($F136=1,VLOOKUP($B$2,$DE$5:$DG$11,2,FALSE),IF($F136=2,VLOOKUP($B$3,$DE$5:$DG$6,2,FALSE),0))","v":0},0,0,0,null,null,null,null,null,"",{"$error":"#VALUE!"},"",{"$error":"#VALUE!"},"",{"$error":"#VALUE!"},"","","",{"$f":"IF(V136>0,COUNTIF(Q$7:Q136,\"=\"&Q136)-1,\"\")","v":""},"",0,0,0,0,0,0,0,0,0,0,0,0,0,0,0,0,0,0,0,0,0,0,0,0,0,0,0,0,0,0,0,0,0,0,0,0,0,0,0,0,0,0,0,0,0,0,0,0,0,0,0,0,0,0,0,0,0,0,0,0,0,0,0,0,0,0,0,0,0,0,0,0,0,0,0,0,0,0,0,null,1,0,0,{"$f":"IF($B136=0,\"\",IF(F136=1,LEFT($B$2,LEN($B$2)-1),LEFT($B$3,LEN($B$3)-1)))","v":""},"p","p",0]
["",0,0,0,0,null,null,null,null,null,"",{"$error":"#VALUE!"},"",{"$error":"#VALUE!"},"",{"$error":"#VALUE!"},"","","",{"$f":"IF(V137>0,COUNTIF(Q$7:Q137,\"=\"&Q137)-1,\"\")","v":""},"",0,{"$f":"$V137-LEN(SUBSTITUTE($J137,W$4,\"\"))","v":0},0,0,0,0,{"$f":"IF($CZ137>0,$V137-LEN(SUBSTITUTE($J137,AB$4,\"\")),0)","v":0},0,0,0,0,0,0,0,0,0,{"$f":"IF($CZ137>0,$V137-LEN(SUBSTITUTE($J137,AL$4,\"\")),0)","v":0},0,0,0,0,0,0,0,0,0,{"$f":"IF($CZ137>0,$V137-LEN(SUBSTITUTE($J137,AV$4,\"\")),0)","v":0},0,0,0,0,0,0,0,0,0,0,0,0,{"$f":"IF($CZ137>0,$V137-LEN(SUBSTITUTE($J137,BI$4,\"\")),0)","v":0},0,0,0,0,0,0,0,0,0,{"$f":"IF($CZ137>0,$V137-LEN(SUBSTITUTE($J137,BS$4,\"\")),0)","v":0},0,0,0,0,0,0,0,0,0,{"$f":"IF($CZ137>0,$V137-LEN(SUBSTITUTE($J137,CC$4,\"\")),0)","v":0},0,0,0,0,0,0,0,0,0,0,0,0,0,0,0,0,0,0,0,null,1,0,0,"","p","p",0]
["",0,0,0,0,null,null,null,null,null,"",{"$error":"#VALUE!"},"",{"$error":"#VALUE!"},"",{"$error":"#VALUE!"},"","","",{"$f":"IF(V138>0,COUNTIF(Q$7:Q138,\"=\"&Q138)-1,\"\")","v":""},"",0,0,0,0,0,0,0,0,0,0,0,0,0,0,0,0,0,0,0,0,0,0,0,0,0,0,0,0,0,0,0,0,0,0,0,0,0,0,0,0,0,0,0,0,0,0,0,0,0,0,0,0,0,0,0,0,0,0,0,0,0,0,0,0,0,0,0,0,0,0,0,0,0,0,0,0,0,0,0,null,1,0,0,"","p","p",0]
["",0,0,0,0,null,null,null,null,null,"",{"$error":"#VALUE!"},"",{"$error":"#VALUE!"},"",{"$error":"#VALUE!"},"","","",{"$f":"IF(V139>0,COUNTIF(Q$7:Q139,\"=\"&Q139)-1,\"\")","v":""},"",0,0,0,0,0,0,0,0,0,0,0,0,0,0,0,0,0,0,0,0,0,0,0,0,0,0,0,0,0,0,0,0,0,0,0,0,0,0,0,0,0,0,0,0,0,0,0,0,0,0,0,0,0,0,0,0,0,0,0,0,0,0,0,0,0,0,0,0,0,0,0,0,0,0,0,0,0,0,0,null,1,0,0,"","p","p",0]
["",0,0,0,0,null,null,null,null,null,"",{"$error":"#VALUE!"},"",{"$error":"#VALUE!"},"",{"$error":"#VALUE!"},"","","",{"$f":"IF(V140>0,COUNTIF(Q$7:Q140,\"=\"&Q140)-1,\"\")","v":""},"",0,0,0,0,0,0,0,0,0,0,0,0,0,0,0,0,0,0,0,0,0,0,0,0,0,0,0,0,0,0,0,0,0,0,0,0,0,0,0,0,0,0,0,0,0,0,0,0,0,0,0,0,0,0,0,0,0,0,0,0,0,0,0,0,0,0,0,0,0,0,0,0,0,0,0,0,0,0,0,null,1,0,0,"","p","p",0]
["",0,0,0,0,null,null,null,null,null,"",{"$error":"#VALUE!"},"",{"$error":"#VALUE!"},"",{"$error":"#VALUE!"},"","","",{"$f":"IF(V141>0,COUNTIF(Q$7:Q141,\"=\"&Q141)-1,\"\")","v":""},"",0,0,0,0,0,0,0,0,0,0,0,0,0,0,0,0,0,0,0,0,0,0,0,0,0,0,0,0,0,0,0,0,0,0,0,0,0,0,0,0,0,0,0,0,0,0,0,0,0,0,0,0,0,0,0,0,0,0,0,0,0,0,0,0,0,0,0,0,0,0,0,0,0,0,0,0,0,0,0,null,1,0,0,"","p","p",0]
["",0,0,0,0,null,null,null,null,null,"",{"$error":"#VALUE!"},"",{"$error":"#VALUE!"},"",{"$error":"#VALUE!"},"","","",{"$f":"IF(V142>0,COUNTIF(Q$7:Q142,\"=\"&Q142)-1,\"\")","v":""},"",0,0,0,0,0,0,0,0,0,0,0,0,0,0,0,0,0,0,0,0,0,0,0,0,0,0,0,0,0,0,0,0,0,0,0,0,0,0,0,0,0,0,0,0,0,0,0,0,0,0,0,0,0,0,0,0,0,0,0,0,0,0,0,0,0,0,0,0,0,0,0,0,0,0,0,0,0,0,0,null,1,0,0,"","p","p",0]
["",0,0,0,0,null,null,null,null,null,"",{"$error":"#VALUE!"},"",{"$error":"#VALUE!"},"",{"$error":"#VALUE!"},"","","",{"$f":"IF(V143>0,COUNTIF(Q$7:Q143,\"=\"&Q143)-1,\"\")","v":""},"",0,0,0,0,0,0,0,0,0,0,0,0,0,0,0,0,0,0,0,0,0,0,0,0,0,0,0,0,0,0,0,0,0,0,0,0,0,0,0,0,0,0,0,0,0,0,0,0,0,0,0,0,0,0,0,0,0,0,0,0,0,0,0,0,0,0,0,0,0,0,0,0,0,0,0,0,0,0,0,null,1,0,0,"","p","p",0]
["",0,0,0,0,null,null,null,null,null,"",{"$error":"#VALUE!"},"",{"$error":"#VALUE!"},"",{"$error":"#VALUE!"},"","","",{"$f":"IF(V144>0,COUNTIF(Q$7:Q144,\"=\"&Q144)-1,\"\")","v":""},"",0,0,0,0,0,0,0,0,0,0,0,0,0,0,0,0,0,0,0,0,0,0,0,0,0,0,0,0,0,0,0,0,0,0,0,0,0,0,0,0,0,0,0,0,0,0,0,0,0,0,0,0,0,0,0,0,0,0,0,0,0,0,0,0,0,0,0,0,0,0,0,0,0,0,0,0,0,0,0,null,1,0,0,"","p","p",0]
["",0,0,0,0,null,null,null,null,null,"",{"$error":"#VALUE!"},"",{"$error":"#VALUE!"},"",{"$error":"#VALUE!"},"","","",{"$f":"IF(V145>0,COUNTIF(Q$7:Q145,\"=\"&Q145)-1,\"\")","v":""},"",0,0,0,0,0,0,0,0,0,0,0,0,0,0,0,0,0,0,0,0,0,0,0,0,0,0,0,0,0,0,0,0,0,0,0,0,0,0,0,0,0,0,0,0,0,0,0,0,0,0,0,0,0,0,0,0,0,0,0,0,0,0,0,0,0,0,0,0,0,0,0,0,0,0,0,0,0,0,0,null,1,0,0,"","p","p",0]
["",0,0,0,0,null,null,null,null,null,"",{"$error":"#VALUE!"},"",{"$error":"#VALUE!"},"",{"$error":"#VALUE!"},"","","",{"$f":"IF(V146>0,COUNTIF(Q$7:Q146,\"=\"&Q146)-1,\"\")","v":""},"",0,0,0,0,0,0,0,0,0,0,0,0,0,0,0,0,0,0,0,0,0,0,0,0,0,0,0,0,0,0,0,0,0,0,0,0,0,0,0,0,0,0,0,0,0,0,0,0,0,0,0,0,0,0,0,0,0,0,0,0,0,0,0,0,0,0,0,0,0,0,0,0,0,0,0,0,0,0,0,null,1,0,0,"","p","p",0]
["",0,0,0,0,null,null,null,null,null,"",{"$error":"#VALUE!"},"",{"$error":"#VALUE!"},"",{"$error":"#VALUE!"},"","","",{"$f":"IF(V147>0,COUNTIF(Q$7:Q147,\"=\"&Q147)-1,\"\")","v":""},"",0,{"$f":"$V147-LEN(SUBSTITUTE($J147,W$4,\"\"))","v":0},0,0,0,0,{"$f":"IF($CZ147>0,$V147-LEN(SUBSTITUTE($J147,AB$4,\"\")),0)","v":0},0,0,0,0,0,0,0,0,0,{"$f":"IF($CZ147>0,$V147-LEN(SUBSTITUTE($J147,AL$4,\"\")),0)","v":0},0,0,0,0,0,0,0,0,0,{"$f":"IF($CZ147>0,$V147-LEN(SUBSTITUTE($J147,AV$4,\"\")),0)","v":0},0,0,0,0,0,0,0,0,0,0,0,0,{"$f":"IF($CZ147>0,$V147-LEN(SUBSTITUTE($J147,BI$4,\"\")),0)","v":0},0,0,0,0,0,0,0,0,0,{"$f":"IF($CZ147>0,$V147-LEN(SUBSTITUTE($J147,BS$4,\"\")),0)","v":0},0,0,0,0,0,0,0,0,0,{"$f":"IF($CZ147>0,$V147-LEN(SUBSTITUTE($J147,CC$4,\"\")),0)","v":0},0,0,0,0,0,0,0,0,0,0,{"$f":"IF($CZ147>0,$V147-LEN(SUBSTITUTE($J147,CN$4,\"\")),0)","v":0},0,0,0,0,0,0,0,0,null,1,0,0,"","p","p",0]
["",0,0,0,0,null,null,null,null,null,"",{"$error":"#VALUE!"},"",{"$error":"#VALUE!"},"",{"$error":"#VALUE!"},"","","",{"$f":"IF(V148>0,COUNTIF(Q$7:Q148,\"=\"&Q148)-1,\"\")","v":""},"",0,0,0,0,0,0,0,0,0,0,0,0,0,0,0,0,0,0,0,0,0,0,0,0,0,0,0,0,0,0,0,0,0,0,0,0,0,0,0,0,0,0,0,0,0,0,0,0,0,0,0,0,0,0,0,0,0,0,0,0,0,0,0,0,0,0,0,0,0,0,0,0,0,0,0,0,0,0,0,null,1,0,0,"","p","p",0]
["",0,0,0,0,null,null,null,null,null,"",{"$error":"#VALUE!"},"",{"$error":"#VALUE!"},"",{"$error":"#VALUE!"},"","","",{"$f":"IF(V149>0,COUNTIF(Q$7:Q149,\"=\"&Q149)-1,\"\")","v":""},"",0,0,0,0,0,0,0,0,0,0,0,0,0,0,0,0,0,0,0,0,0,0,0,0,0,0,0,0,0,0,0,0,0,0,0,0,0,0,0,0,0,0,0,0,0,0,0,0,0,0,0,0,0,0,0,0,0,0,0,0,0,0,0,0,0,0,0,0,0,0,0,0,0,0,0,0,0,0,0,null,1,0,0,"","p","p",0]
["",0,0,0,0,null,null,null,null,null,"",{"$error":"#VALUE!"},"",{"$error":"#VALUE!"},"",{"$error":"#VALUE!"},"","","",{"$f":"IF(V150>0,COUNTIF(Q$7:Q150,\"=\"&Q150)-1,\"\")","v":""},"",0,0,0,0,0,0,0,0,0,0,0,0,0,0,0,0,0,0,0,0,0,0,0,0,0,0,0,0,0,0,0,0,0,0,0,0,0,0,0,0,0,0,0,0,0,0,0,0,0,0,0,0,0,0,0,0,0,0,0,0,0,0,0,0,0,0,0,0,0,0,0,0,0,0,0,0,0,0,0,null,1,0,0,"","p","p",0]
["",0,0,0,0,null,null,null,null,null,"",{"$error":"#VALUE!"},"",{"$error":"#VALUE!"},"",{"$error":"#VALUE!"},"","","",{"$f":"IF(V151>0,COUNTIF(Q$7:Q151,\"=\"&Q151)-1,\"\")","v":""},"",0,0,0,0,0,0,0,0,0,0,0,0,0,0,0,0,0,0,0,0,0,0,0,0,0,0,0,0,0,0,0,0,0,0,0,0,0,0,0,0,0,0,0,0,0,0,0,0,0,0,0,0,0,0,0,0,0,0,0,0,0,0,0,0,0,0,0,0,0,0,0,0,0,0,{"$f":"IF($CZ151>0,$V151-LEN(SUBSTITUTE($J151,CR$4,\"\")),0)","v":0},0,0,0,0,null,1,0,0,"","p","p",0]
["",0,0,0,0,null,null,null,null,null,"",{"$error":"#VALUE!"},"",{"$error":"#VALUE!"},"",{"$error":"#VALUE!"},"","","",{"$f":"IF(V152>0,COUNTIF(Q$7:Q152,\"=\"&Q152)-1,\"\")","v":""},"",0,0,0,0,0,0,0,0,0,0,0,0,0,0,0,0,0,0,0,0,0,0,0,0,0,0,0,0,0,0,0,0,0,0,0,0,0,0,0,0,0,0,0,0,0,0,0,0,0,0,0,0,0,0,0,0,0,0,0,0,0,0,0,0,0,0,0,0,0,0,0,0,0,0,0,0,0,0,0,null,1,0,0,"","p","p",0]
["",0,0,0,0,null,null,null,null,null,"",{"$error":"#VALUE!"},"",{"$error":"#VALUE!"},"",{"$error":"#VALUE!"},"","","",{"$f":"IF(V153>0,COUNTIF(Q$7:Q153,\"=\"&Q153)-1,\"\")","v":""},"",0,0,0,0,0,0,0,0,0,0,0,0,0,0,0,0,0,0,0,0,0,0,0,0,0,0,0,0,0,0,0,0,0,0,0,0,0,0,0,0,0,0,0,0,0,0,0,0,0,0,0,0,0,0,0,0,0,0,0,0,0,0,0,0,0,0,0,0,0,0,0,0,0,0,0,0,0,0,0,null,1,0,0,"","p","p",0]
["",0,0,0,0,null,null,null,null,null,"",{"$error":"#VALUE!"},"",{"$error":"#VALUE!"},"",{"$error":"#VALUE!"},"","","",{"$f":"IF(V154>0,COUNTIF(Q$7:Q154,\"=\"&Q154)-1,\"\")","v":""},"",0,0,0,0,0,0,0,0,0,0,0,0,0,0,0,0,0,0,0,0,0,0,0,0,0,0,0,0,0,0,0,0,0,0,0,0,0,0,0,0,0,0,0,0,0,0,0,0,0,0,0,0,0,0,0,0,0,0,0,0,0,0,0,0,0,0,0,0,0,0,0,0,0,0,0,0,0,0,0,null,1,0,0,"","p","p",0]
["",0,0,0,0,null,null,null,null,null,"",{"$error":"#VALUE!"},"",{"$error":"#VALUE!"},"",{"$error":"#VALUE!"},"","","",{"$f":"IF(V155>0,COUNTIF(Q$7:Q155,\"=\"&Q155)-1,\"\")","v":""},"",0,0,0,0,0,0,0,0,0,0,0,0,0,0,0,0,0,0,0,0,0,0,0,0,0,0,0,0,0,0,0,0,0,0,0,0,0,0,0,0,0,0,0,0,0,0,0,0,0,0,0,0,0,0,0,0,0,0,0,0,0,0,0,0,0,0,0,0,0,0,0,0,0,0,0,0,0,0,0,null,1,0,0,"","p","p",0]
["",0,0,0,0,null,null,null,null,null,"",{"$error":"#VALUE!"},"",{"$error":"#VALUE!"},"",{"$error":"#VALUE!"},"","","",{"$f":"IF(V156>0,COUNTIF(Q$7:Q156,\"=\"&Q156)-1,\"\")","v":""},"",0,0,0,0,0,0,0,0,0,0,0,0,0,0,0,0,0,0,0,0,0,0,0,0,0,0,0,0,0,0,0,0,0,0,0,0,0,0,0,0,0,0,0,0,0,0,0,0,0,0,0,0,0,0,0,0,0,0,0,0,0,0,0,0,0,0,0,0,0,0,0,0,0,0,0,0,0,0,0,null,1,0,0,"","p","p",0]
["",0,0,0,0,null,null,null,null,null,"",{"$error":"#VALUE!"},"",{"$error":"#VALUE!"},"",{"$error":"#VALUE!"},"","","",{"$f":"IF(V157>0,COUNTIF(Q$7:Q157,\"=\"&Q157)-1,\"\")","v":""},"",0,{"$f":"$V157-LEN(SUBSTITUTE($J157,W$4,\"\"))","v":0},0,0,0,0,{"$f":"IF($CZ157>0,$V157-LEN(SUBSTITUTE($J157,AB$4,\"\")),0)","v":0},0,0,0,0,0,0,0,0,0,{"$f":"IF($CZ157>0,$V157-LEN(SUBSTITUTE($J157,AL$4,\"\")),0)","v":0},0,0,0,0,0,0,0,0,0,{"$f":"IF($CZ157>0,$V157-LEN(SUBSTITUTE($J157,AV$4,\"\")),0)","v":0},0,0,0,0,0,0,0,0,0,0,0,0,{"$f":"IF($CZ157>0,$V157-LEN(SUBSTITUTE($J157,BI$4,\"\")),0)","v":0},0,0,0,0,0,0,0,0,0,{"$f":"IF($CZ157>0,$V157-LEN(SUBSTITUTE($J157,BS$4,\"\")),0)","v":0},0,0,0,0,0,0,0,0,0,{"$f":"IF($CZ157>0,$V157-LEN(SUBSTITUTE($J157,CC$4,\"\")),0)","v":0},0,0,0,0,0,0,0,0,0,0,0,0,0,0,0,0,0,0,0,null,1,0,0,"","p","p",0]
["",0,0,0,0,null,null,null,null,null,"",{"$error":"#VALUE!"},"",{"$error":"#VALUE!"},"",{"$error":"#VALUE!"},"","","",{"$f":"IF(V158>0,COUNTIF(Q$7:Q158,\"=\"&Q158)-1,\"\")","v":""},"",0,0,0,0,0,0,0,0,0,0,0,0,0,0,0,0,0,0,0,0,0,0,0,0,0,0,0,0,0,0,0,0,0,0,0,0,0,0,0,0,0,0,0,0,0,0,0,0,0,0,0,0,0,0,0,0,0,0,0,0,0,0,0,0,0,0,0,0,0,0,0,0,0,0,0,0,0,0,0,null,1,0,0,"","p","p",0]
["",0,0,0,0,null,null,null,null,null,"",{"$error":"#VALUE!"},"",{"$error":"#VALUE!"},"",{"$error":"#VALUE!"},"","","",{"$f":"IF(V159>0,COUNTIF(Q$7:Q159,\"=\"&Q159)-1,\"\")","v":""},"",0,0,0,0,0,0,0,0,0,0,0,0,0,0,0,0,0,0,0,0,0,0,0,0,0,0,0,0,0,0,0,0,0,0,0,0,0,0,0,0,0,0,0,0,0,0,0,0,0,0,0,0,0,0,0,0,0,0,0,0,0,0,0,0,0,0,0,0,0,0,0,0,0,0,0,0,0,0,0,null,1,0,0,"","p","p",0]
["",0,0,0,0,null,null,null,null,null,"",{"$error":"#VALUE!"},"",{"$error":"#VALUE!"},"",{"$error":"#VALUE!"},"","","",{"$f":"IF(V160>0,COUNTIF(Q$7:Q160,\"=\"&Q160)-1,\"\")","v":""},"",0,0,0,0,0,0,0,0,0,0,0,0,0,0,0,0,0,0,0,0,0,0,0,0,0,0,0,0,0,0,0,0,0,0,0,0,0,0,0,0,0,0,0,0,0,0,0,0,0,0,0,0,0,0,0,0,0,0,0,0,0,0,0,0,0,0,0,0,0,0,0,0,0,0,0,0,0,0,0,null,1,0,0,"","p","p",0]
["",0,0,0,0,null,null,null,null,null,"",{"$error":"#VALUE!"},"",{"$error":"#VALUE!"},"",{"$error":"#VALUE!"},"","","",{"$f":"IF(V161>0,COUNTIF(Q$7:Q161,\"=\"&Q161)-1,\"\")","v":""},"",0,0,0,0,0,0,0,0,0,0,0,0,0,0,0,0,0,0,0,0,0,0,0,0,0,0,0,0,0,0,0,0,0,0,0,0,0,0,0,0,0,0,0,0,0,0,0,0,0,0,0,0,0,0,0,0,0,0,0,0,0,0,0,0,0,0,0,0,0,0,0,0,0,0,0,0,0,0,0,null,1,0,0,"","p","p",0]
["",0,0,0,0,null,null,null,null,null,"",{"$error":"#VALUE!"},"",{"$error":"#VALUE!"},"",{"$error":"#VALUE!"},"","","",{"$f":"IF(V162>0,COUNTIF(Q$7:Q162,\"=\"&Q162)-1,\"\")","v":""},"",0,0,0,0,0,0,0,0,0,0,0,0,0,0,0,0,0,0,0,0,0,0,0,0,0,0,0,0,0,0,0,0,0,0,0,0,0,0,0,0,0,0,0,0,0,0,0,0,0,0,0,0,0,0,0,0,0,0,0,0,0,0,0,0,0,0,0,0,0,0,0,0,0,0,0,0,0,0,0,null,1,0,0,"","p","p",0]
["",0,0,0,0,null,null,null,null,null,"",{"$error":"#VALUE!"},"",{"$error":"#VALUE!"},"",{"$error":"#VALUE!"},"","","",{"$f":"IF(V163>0,COUNTIF(Q$7:Q163,\"=\"&Q163)-1,\"\")","v":""},"",0,0,0,0,0,0,0,0,0,0,0,0,0,0,0,0,0,0,0,0,0,0,0,0,0,0,0,0,0,0,0,0,0,0,0,0,0,0,0,0,0,0,0,0,0,0,0,0,0,0,0,0,0,0,0,0,0,0,0,0,0,0,0,0,0,0,0,0,0,0,0,0,0,0,0,0,0,0,0,null,1,0,0,"","p","p",0]
["",0,0,0,0,null,null,null,null,null,"",{"$error":"#VALUE!"},"",{"$error":"#VALUE!"},"",{"$error":"#VALUE!"},"","","",{"$f":"IF(V164>0,COUNTIF(Q$7:Q164,\"=\"&Q164)-1,\"\")","v":""},"",0,0,0,0,0,0,0,0,0,0,0,0,0,0,0,0,0,0,0,0,0,0,0,0,0,0,0,0,0,0,0,0,0,0,0,0,0,0,0,0,0,0,0,0,0,0,0,0,0,0,0,0,0,0,0,0,0,0,0,0,0,0,0,0,0,0,0,0,0,0,0,0,0,0,0,0,0,0,0,null,1,0,0,"","p","p",0]
["",0,0,0,0,null,null,null,null,null,"",{"$error":"#VALUE!"},"",{"$error":"#VALUE!"},"",{"$error":"#VALUE!"},"","","",{"$f":"IF(V165>0,COUNTIF(Q$7:Q165,\"=\"&Q165)-1,\"\")","v":""},"",0,0,0,0,0,0,0,0,0,0,0,0,0,0,0,0,0,0,0,0,0,0,0,0,0,0,0,0,0,0,0,0,0,0,0,0,0,0,0,0,0,0,0,0,0,0,0,0,0,0,0,0,0,0,0,0,0,0,0,0,0,0,0,0,0,0,0,0,0,0,0,0,0,0,0,0,0,0,0,null,1,0,0,"","p","p",0]
["",0,0,0,0,null,null,null,null,null,"",{"$error":"#VALUE!"},"",{"$error":"#VALUE!"},"",{"$error":"#VALUE!"},"","","",{"$f":"IF(V166>0,COUNTIF(Q$7:Q166,\"=\"&Q166)-1,\"\")","v":""},"",0,0,0,0,0,0,0,0,0,0,0,0,0,0,0,0,0,0,0,0,0,0,0,0,0,0,0,0,0,0,0,0,0,0,0,0,0,0,0,0,0,0,0,0,0,0,0,0,0,0,0,0,0,0,0,0,0,0,0,0,0,0,0,0,0,0,0,0,0,0,0,0,0,0,0,0,0,0,0,null,1,0,0,"","p","p",0]
["",0,0,0,0,null,null,null,null,null,"",{"$error":"#VALUE!"},"",{"$error":"#VALUE!"},"",{"$error":"#VALUE!"},"","","",{"$f":"IF(V167>0,COUNTIF(Q$7:Q167,\"=\"&Q167)-1,\"\")","v":""},"",0,{"$f":"$V167-LEN(SUBSTITUTE($J167,W$4,\"\"))","v":0},0,0,0,0,{"$f":"IF($CZ167>0,$V167-LEN(SUBSTITUTE($J167,AB$4,\"\")),0)","v":0},0,0,0,0,0,0,0,0,0,{"$f":"IF($CZ167>0,$V167-LEN(SUBSTITUTE($J167,AL$4,\"\")),0)","v":0},0,0,0,0,0,0,0,0,0,{"$f":"IF($CZ167>0,$V167-LEN(SUBSTITUTE($J167,AV$4,\"\")),0)","v":0},0,0,0,0,0,0,0,0,0,0,0,0,{"$f":"IF($CZ167>0,$V167-LEN(SUBSTITUTE($J167,BI$4,\"\")),0)","v":0},0,0,0,0,0,0,0,0,0,{"$f":"IF($CZ167>0,$V167-LEN(SUBSTITUTE($J167,BS$4,\"\")),0)","v":0},0,0,0,0,0,0,0,0,0,{"$f":"IF($CZ167>0,$V167-LEN(SUBSTITUTE($J167,CC$4,\"\")),0)","v":0},0,0,0,0,0,0,0,0,0,0,{"$f":"IF($CZ167>0,$V167-LEN(SUBSTITUTE($J167,CN$4,\"\")),0)","v":0},0,0,0,{"$f":"IF($CZ167>0,$V167-LEN(SUBSTITUTE($J167,CR$4,\"\")),0)","v":0},0,0,0,0,null,1,0,0,"","p","p",0]
["",0,0,0,0,null,null,null,null,null,"",{"$error":"#VALUE!"},"",{"$error":"#VALUE!"},"",{"$error":"#VALUE!"},"","","",{"$f":"IF(V168>0,COUNTIF(Q$7:Q168,\"=\"&Q168)-1,\"\")","v":""},"",0,0,0,0,0,0,0,0,0,0,0,0,0,0,0,0,0,0,0,0,0,0,0,0,0,0,0,0,0,0,0,0,0,0,0,0,0,0,0,0,0,0,0,0,0,0,0,0,0,0,0,0,0,0,0,0,0,0,0,0,0,0,0,0,0,0,0,0,0,0,0,0,0,0,0,0,0,0,0,null,1,0,0,"","p","p",0]
["",0,0,0,0,null,null,null,null,null,"",{"$error":"#VALUE!"},"",{"$error":"#VALUE!"},"",{"$error":"#VALUE!"},"","","",{"$f":"IF(V169>0,COUNTIF(Q$7:Q169,\"=\"&Q169)-1,\"\")","v":""},"",0,0,0,0,0,0,0,0,0,0,0,0,0,0,0,0,0,0,0,0,0,0,0,0,0,0,0,0,0,0,0,0,0,0,0,0,0,0,0,0,0,0,0,0,0,0,0,0,0,0,0,0,0,0,0,0,0,0,0,0,0,0,0,0,0,0,0,0,0,0,0,0,0,0,0,0,0,0,0,null,1,0,0,"","p","p",0]
["",0,0,0,0,null,null,null,null,null,"",{"$error":"#VALUE!"},"",{"$error":"#VALUE!"},"",{"$error":"#VALUE!"},"","","",{"$f":"IF(V170>0,COUNTIF(Q$7:Q170,\"=\"&Q170)-1,\"\")","v":""},"",0,0,0,0,0,0,0,0,0,0,0,0,0,0,0,0,0,0,0,0,0,0,0,0,0,0,0,0,0,0,0,0,0,0,0,0,0,0,0,0,0,0,0,0,0,0,0,0,0,0,0,0,0,0,0,0,0,0,0,0,0,0,0,0,0,0,0,0,0,0,0,0,0,0,0,0,0,0,0,null,1,0,0,"","p","p",0]
["",0,0,0,0,null,null,null,null,null,"",{"$error":"#VALUE!"},"",{"$error":"#VALUE!"},"",{"$error":"#VALUE!"},"","","",{"$f":"IF(V171>0,COUNTIF(Q$7:Q171,\"=\"&Q171)-1,\"\")","v":""},"",0,0,0,0,0,0,0,0,0,0,0,0,0,0,0,0,0,0,0,0,0,0,0,0,0,0,0,0,0,0,0,0,0,0,0,0,0,0,0,0,0,0,0,0,0,0,0,0,0,0,0,0,0,0,0,0,0,0,0,0,0,0,0,0,0,0,0,0,0,0,0,0,0,0,0,0,0,0,0,null,1,0,0,"","p","p",0]
["",0,0,0,0,null,null,null,null,null,"",{"$error":"#VALUE!"},"",{"$error":"#VALUE!"},"",{"$error":"#VALUE!"},"","","",{"$f":"IF(V172>0,COUNTIF(Q$7:Q172,\"=\"&Q172)-1,\"\")","v":""},"",0,0,0,0,0,0,0,0,0,0,0,0,0,0,0,0,0,0,0,0,0,0,0,0,0,0,0,0,0,0,0,0,0,0,0,0,0,0,0,0,0,0,0,0,0,0,0,0,0,0,0,0,0,0,0,0,0,0,0,0,0,0,0,0,0,0,0,0,0,0,0,0,0,0,0,0,0,0,0,null,1,0,0,"","p","p",0]
["",0,0,0,0,null,null,null,null,null,"",{"$error":"#VALUE!"},"",{"$error":"#VALUE!"},"",{"$error":"#VALUE!"},"","","",{"$f":"IF(V173>0,COUNTIF(Q$7:Q173,\"=\"&Q173)-1,\"\")","v":""},"",0,0,0,0,0,0,0,0,0,0,0,0,0,0,0,0,0,0,0,0,0,0,0,0,0,0,0,0,0,0,0,0,0,0,0,0,0,0,0,0,0,0,0,0,0,0,0,0,0,0,0,0,0,0,0,0,0,0,0,0,0,0,0,0,0,0,0,0,0,0,0,0,0,0,0,0,0,0,0,null,1,0,0,"","p","p",0]
["",0,0,0,0,null,null,null,null,null,"",{"$error":"#VALUE!"},"",{"$error":"#VALUE!"},"",{"$error":"#VALUE!"},"","","",{"$f":"IF(V174>0,COUNTIF(Q$7:Q174,\"=\"&Q174)-1,\"\")","v":""},"",0,0,0,0,0,0,0,0,0,0,0,0,0,0,0,0,0,0,0,0,0,0,0,0,0,0,0,0,0,0,0,0,0,0,0,0,0,0,0,0,0,0,0,0,0,0,0,0,0,0,0,0,0,0,0,0,0,0,0,0,0,0,0,0,0,0,0,0,0,0,0,0,0,0,0,0,0,0,0,null,1,0,0,"","p","p",0]
["",0,0,0,0,null,null,null,null,null,"",{"$error":"#VALUE!"},"",{"$error":"#VALUE!"},"",{"$error":"#VALUE!"},"","","",{"$f":"IF(V175>0,COUNTIF(Q$7:Q175,\"=\"&Q175)-1,\"\")","v":""},"",0,0,0,0,0,0,0,0,0,0,0,0,0,0,0,0,0,0,0,0,0,0,0,0,0,0,0,0,0,0,0,0,0,0,0,0,0,0,0,0,0,0,0,0,0,0,0,0,0,0,0,0,0,0,0,0,0,0,0,0,0,0,0,0,0,0,0,0,0,0,0,0,0,0,0,0,0,0,0,null,1,0,0,"","p","p",0]
["",0,0,0,0,null,null,null,null,null,"",{"$error":"#VALUE!"},"",{"$error":"#VALUE!"},"",{"$error":"#VALUE!"},"","","",{"$f":"IF(V176>0,COUNTIF(Q$7:Q176,\"=\"&Q176)-1,\"\")","v":""},"",0,0,0,0,0,0,0,0,0,0,0,0,0,0,0,0,0,0,0,0,0,0,0,0,0,0,0,0,0,0,0,0,0,0,0,0,0,0,0,0,0,0,0,0,0,0,0,0,0,0,0,0,0,0,0,0,0,0,0,0,0,0,0,0,0,0,0,0,0,0,0,0,0,0,0,0,0,0,0,null,1,0,0,"","p","p",0]
["",0,0,0,0,null,null,null,null,null,"",{"$error":"#VALUE!"},"",{"$error":"#VALUE!"},"",{"$error":"#VALUE!"},"","","",{"$f":"IF(V177>0,COUNTIF(Q$7:Q177,\"=\"&Q177)-1,\"\")","v":""},"",0,{"$f":"$V177-LEN(SUBSTITUTE($J177,W$4,\"\"))","v":0},0,0,0,0,{"$f":"IF($CZ177>0,$V177-LEN(SUBSTITUTE($J177,AB$4,\"\")),0)","v":0},0,0,0,0,0,0,0,0,0,{"$f":"IF($CZ177>0,$V177-LEN(SUBSTITUTE($J177,AL$4,\"\")),0)","v":0},0,0,0,0,0,0,0,0,0,{"$f":"IF($CZ177>0,$V177-LEN(SUBSTITUTE($J177,AV$4,\"\")),0)","v":0},0,0,0,0,0,0,0,0,0,0,0,0,{"$f":"IF($CZ177>0,$V177-LEN(SUBSTITUTE($J177,BI$4,\"\")),0)","v":0},0,0,0,0,0,0,0,0,0,{"$f":"IF($CZ177>0,$V177-LEN(SUBSTITUTE($J177,BS$4,\"\")),0)","v":0},0,0,0,0,0,0,0,0,0,{"$f":"IF($CZ177>0,$V177-LEN(SUBSTITUTE($J177,CC$4,\"\")),0)","v":0},0,0,0,0,0,0,0,0,0,0,0,0,0,0,0,0,0,0,0,null,1,0,0,"","p","p",0]
["",0,0,0,0,null,null,null,null,null,"",{"$error":"#VALUE!"},"",{"$error":"#VALUE!"},"",{"$error":"#VALUE!"},"","","",{"$f":"IF(V178>0,COUNTIF(Q$7:Q178,\"=\"&Q178)-1,\"\")","v":""},"",0,0,0,0,0,0,0,0,0,0,0,0,0,0,0,0,0,0,0,0,0,0,0,0,0,0,0,0,0,0,0,0,0,0,0,0,0,0,0,0,0,0,0,0,0,0,0,0,0,0,0,0,0,0,0,0,0,0,0,0,0,0,0,0,0,0,0,0,0,0,0,0,0,0,0,0,0,0,0,null,1,0,0,"","p","p",0]
["",0,0,0,0,null,null,null,null,null,"",{"$error":"#VALUE!"},"",{"$error":"#VALUE!"},"",{"$error":"#VALUE!"},"","","",{"$f":"IF(V179>0,COUNTIF(Q$7:Q179,\"=\"&Q179)-1,\"\")","v":""},"",0,0,0,0,0,0,0,0,0,0,0,0,0,0,0,0,0,0,0,0,0,0,0,0,0,0,0,0,0,0,0,0,0,0,0,0,0,0,0,0,0,0,0,0,0,0,0,0,0,0,0,0,0,0,0,0,0,0,0,0,0,0,0,0,0,0,0,0,0,0,0,0,0,0,0,0,0,0,0,null,1,0,0,"","p","p",0]
["",0,0,0,0,null,null,null,null,null,"",{"$error":"#VALUE!"},"",{"$error":"#VALUE!"},"",{"$error":"#VALUE!"},"","","",{"$f":"IF(V180>0,COUNTIF(Q$7:Q180,\"=\"&Q180)-1,\"\")","v":""},"",0,0,0,0,0,0,0,0,0,0,0,0,0,0,0,0,0,0,0,0,0,0,0,0,0,0,0,0,0,0,0,0,0,0,0,0,0,0,0,0,0,0,0,0,0,0,0,0,0,0,0,0,0,0,0,0,0,0,0,0,0,0,0,0,0,0,0,0,0,0,0,0,0,0,0,0,0,0,0,null,1,0,0,"","p","p",0]
["",0,0,0,0,null,null,null,null,null,"",{"$error":"#VALUE!"},"",{"$error":"#VALUE!"},"",{"$error":"#VALUE!"},"","","",{"$f":"IF(V181>0,COUNTIF(Q$7:Q181,\"=\"&Q181)-1,\"\")","v":""},"",0,0,0,0,0,0,0,0,0,0,0,0,0,0,0,0,0,0,0,0,0,0,0,0,0,0,0,0,0,0,0,0,0,0,0,0,0,0,0,0,0,0,0,0,0,0,0,0,0,0,0,0,0,0,0,0,0,0,0,0,0,0,0,0,0,0,0,0,0,0,0,0,0,0,0,0,0,0,0,null,1,0,0,"","p","p",0]
["",0,0,0,0,null,null,null,null,null,"",{"$error":"#VALUE!"},"",{"$error":"#VALUE!"},"",{"$error":"#VALUE!"},"","","",{"$f":"IF(V182>0,COUNTIF(Q$7:Q182,\"=\"&Q182)-1,\"\")","v":""},"",0,0,0,0,0,0,0,0,0,0,0,0,0,0,0,0,0,0,0,0,0,0,0,0,0,0,0,0,0,0,0,0,0,0,0,0,0,0,0,0,0,0,0,0,0,0,0,0,0,0,0,0,0,0,0,0,0,0,0,0,0,0,0,0,0,0,0,0,0,0,0,0,0,0,0,0,0,0,0,null,1,0,0,"","p","p",0]
["",0,0,0,0,null,null,null,null,null,"",{"$error":"#VALUE!"},"",{"$error":"#VALUE!"},"",{"$error":"#VALUE!"},"","","",{"$f":"IF(V183>0,COUNTIF(Q$7:Q183,\"=\"&Q183)-1,\"\")","v":""},"",0,0,0,0,0,0,0,0,0,0,0,0,0,0,0,0,0,0,0,0,0,0,0,0,0,0,0,0,0,0,0,0,0,0,0,0,0,0,0,0,0,0,0,0,0,0,0,0,0,0,0,0,0,0,0,0,0,0,0,0,0,0,0,0,0,0,0,0,0,0,0,0,0,0,{"$f":"IF($CZ183>0,$V183-LEN(SUBSTITUTE($J183,CR$4,\"\")),0)","v":0},0,0,0,0,null,1,0,0,"","p","p",0]
["",0,0,0,0,null,null,null,null,null,"",{"$error":"#VALUE!"},"",{"$error":"#VALUE!"},"",{"$error":"#VALUE!"},"","","",{"$f":"IF(V184>0,COUNTIF(Q$7:Q184,\"=\"&Q184)-1,\"\")","v":""},"",0,0,0,0,0,0,0,0,0,0,0,0,0,0,0,0,0,0,0,0,0,0,0,0,0,0,0,0,0,0,0,0,0,0,0,0,0,0,0,0,0,0,0,0,0,0,0,0,0,0,0,0,0,0,0,0,0,0,0,0,0,0,0,0,0,0,0,0,0,0,0,0,0,0,0,0,0,0,0,null,1,0,0,"","p","p",0]
["",0,0,0,0,null,null,null,null,null,"",{"$error":"#VALUE!"},"",{"$error":"#VALUE!"},"",{"$error":"#VALUE!"},"","","",{"$f":"IF(V185>0,COUNTIF(Q$7:Q185,\"=\"&Q185)-1,\"\")","v":""},"",0,0,0,0,0,0,0,0,0,0,0,0,0,0,0,0,0,0,0,0,0,0,0,0,0,0,0,0,0,0,0,0,0,0,0,0,0,0,0,0,0,0,0,0,0,0,0,0,0,0,0,0,0,0,0,0,0,0,0,0,0,0,0,0,0,0,0,0,0,0,0,0,0,0,0,0,0,0,0,null,1,0,0,"","p","p",0]
["",0,0,0,0,null,null,null,null,null,"",{"$error":"#VALUE!"},"",{"$error":"#VALUE!"},"",{"$error":"#VALUE!"},"","","",{"$f":"IF(V186>0,COUNTIF(Q$7:Q186,\"=\"&Q186)-1,\"\")","v":""},"",0,0,0,0,0,0,0,0,0,0,0,0,0,0,0,0,0,0,0,0,0,0,0,0,0,0,0,0,0,0,0,0,0,0,0,0,0,0,0,0,0,0,0,0,0,0,0,0,0,0,0,0,0,0,0,0,0,0,0,0,0,0,0,0,0,0,0,0,0,0,0,0,0,0,0,0,0,0,0,null,1,0,0,"","p","p",0]
["",0,0,0,0,null,null,null,null,null,"",{"$error":"#VALUE!"},"",{"$error":"#VALUE!"},"",{"$error":"#VALUE!"},"","","",{"$f":"IF(V187>0,COUNTIF(Q$7:Q187,\"=\"&Q187)-1,\"\")","v":""},"",0,{"$f":"$V187-LEN(SUBSTITUTE($J187,W$4,\"\"))","v":0},0,0,0,0,{"$f":"IF($CZ187>0,$V187-LEN(SUBSTITUTE($J187,AB$4,\"\")),0)","v":0},0,0,0,0,0,0,0,0,0,{"$f":"IF($CZ187>0,$V187-LEN(SUBSTITUTE($J187,AL$4,\"\")),0)","v":0},0,0,0,0,0,0,0,0,0,{"$f":"IF($CZ187>0,$V187-LEN(SUBSTITUTE($J187,AV$4,\"\")),0)","v":0},0,0,0,0,0,0,0,0,0,0,0,0,{"$f":"IF($CZ187>0,$V187-LEN(SUBSTITUTE($J187,BI$4,\"\")),0)","v":0},0,0,0,0,0,0,0,0,0,{"$f":"IF($CZ187>0,$V187-LEN(SUBSTITUTE($J187,BS$4,\"\")),0)","v":0},0,0,0,0,0,0,0,0,0,{"$f":"IF($CZ187>0,$V187-LEN(SUBSTITUTE($J187,CC$4,\"\")),0)","v":0},0,0,0,0,0,0,0,0,0,0,{"$f":"IF($CZ187>0,$V187-LEN(SUBSTITUTE($J187,CN$4,\"\")),0)","v":0},0,0,0,0,0,0,0,0,null,1,0,0,"","p","p",0]
["",0,0,0,0,null,null,null,null,null,"",{"$error":"#VALUE!"},"",{"$error":"#VALUE!"},"",{"$error":"#VALUE!"},"","","",{"$f":"IF(V188>0,COUNTIF(Q$7:Q188,\"=\"&Q188)-1,\"\")","v":""},"",0,0,0,0,0,0,0,0,0,0,0,0,0,0,0,0,0,0,0,0,0,0,0,0,0,0,0,0,0,0,0,0,0,0,0,0,0,0,0,0,0,0,0,0,0,0,0,0,0,0,0,0,0,0,0,0,0,0,0,0,0,0,0,0,0,0,0,0,0,0,0,0,0,0,0,0,0,0,0,null,1,0,0,"","p","p",0]
["",0,0,0,0,null,null,null,null,null,"",{"$error":"#VALUE!"},"",{"$error":"#VALUE!"},"",{"$error":"#VALUE!"},"","","",{"$f":"IF(V189>0,COUNTIF(Q$7:Q189,\"=\"&Q189)-1,\"\")","v":""},"",0,0,0,0,0,0,0,0,0,0,0,0,0,0,0,0,0,0,0,0,0,0,0,0,0,0,0,0,0,0,0,0,0,0,0,0,0,0,0,0,0,0,0,0,0,0,0,0,0,0,0,0,0,0,0,0,0,0,0,0,0,0,0,0,0,0,0,0,0,0,0,0,0,0,0,0,0,0,0,null,1,0,0,"","p","p",0]
["",0,0,0,0,null,null,null,null,null,"",{"$error":"#VALUE!"},"",{"$error":"#VALUE!"},"",{"$error":"#VALUE!"},"","","",{"$f":"IF(V190>0,COUNTIF(Q$7:Q190,\"=\"&Q190)-1,\"\")","v":""},"",0,0,0,0,0,0,0,0,0,0,0,0,0,0,0,0,0,0,0,0,0,0,0,0,0,0,0,0,0,0,0,0,0,0,0,0,0,0,0,0,0,0,0,0,0,0,0,0,0,0,0,0,0,0,0,0,0,0,0,0,0,0,0,0,0,0,0,0,0,0,0,0,0,0,0,0,0,0,0,null,1,0,0,"","p","p",0]
["",0,0,0,0,null,null,null,null,null,"",{"$error":"#VALUE!"},"",{"$error":"#VALUE!"},"",{"$error":"#VALUE!"},"","","",{"$f":"IF(V191>0,COUNTIF(Q$7:Q191,\"=\"&Q191)-1,\"\")","v":""},"",0,0,0,0,0,0,0,0,0,0,0,0,0,0,0,0,0,0,0,0,0,0,0,0,0,0,0,0,0,0,0,0,0,0,0,0,0,0,0,0,0,0,0,0,0,0,0,0,0,0,0,0,0,0,0,0,0,0,0,0,0,0,0,0,0,0,0,0,0,0,0,0,0,0,0,0,0,0,0,null,1,0,0,"","p","p",0]
["",0,0,0,0,null,null,null,null,null,"",{"$error":"#VALUE!"},"",{"$error":"#VALUE!"},"",{"$error":"#VALUE!"},"","","",{"$f":"IF(V192>0,COUNTIF(Q$7:Q192,\"=\"&Q192)-1,\"\")","v":""},"",0,0,0,0,0,0,0,0,0,0,0,0,0,0,0,0,0,0,0,0,0,0,0,0,0,0,0,0,0,0,0,0,0,0,0,0,0,0,0,0,0,0,0,0,0,0,0,0,0,0,0,0,0,0,0,0,0,0,0,0,0,0,0,0,0,0,0,0,0,0,0,0,0,0,0,0,0,0,0,null,1,0,0,"","p","p",0]
["",0,0,0,0,null,null,null,null,null,"",{"$error":"#VALUE!"},"",{"$error":"#VALUE!"},"",{"$error":"#VALUE!"},"","","",{"$f":"IF(V193>0,COUNTIF(Q$7:Q193,\"=\"&Q193)-1,\"\")","v":""},"",0,0,0,0,0,0,0,0,0,0,0,0,0,0,0,0,0,0,0,0,0,0,0,0,0,0,0,0,0,0,0,0,0,0,0,0,0,0,0,0,0,0,0,0,0,0,0,0,0,0,0,0,0,0,0,0,0,0,0,0,0,0,0,0,0,0,0,0,0,0,0,0,0,0,0,0,0,0,0,null,1,0,0,"","p","p",0]
["",0,0,0,0,null,null,null,null,null,"",{"$error":"#VALUE!"},"",{"$error":"#VALUE!"},"",{"$error":"#VALUE!"},"","","",{"$f":"IF(V194>0,COUNTIF(Q$7:Q194,\"=\"&Q194)-1,\"\")","v":""},"",0,0,0,0,0,0,0,0,0,0,0,0,0,0,0,0,0,0,0,0,0,0,0,0,0,0,0,0,0,0,0,0,0,0,0,0,0,0,0,0,0,0,0,0,0,0,0,0,0,0,0,0,0,0,0,0,0,0,0,0,0,0,0,0,0,0,0,0,0,0,0,0,0,0,0,0,0,0,0,null,1,0,0,"","p","p",0]
["",0,0,0,0,null,null,null,null,null,"",{"$error":"#VALUE!"},"",{"$error":"#VALUE!"},"",{"$error":"#VALUE!"},"","","",{"$f":"IF(V195>0,COUNTIF(Q$7:Q195,\"=\"&Q195)-1,\"\")","v":""},"",0,0,0,0,0,0,0,0,0,0,0,0,0,0,0,0,0,0,0,0,0,0,0,0,0,0,0,0,0,0,0,0,0,0,0,0,0,0,0,0,0,0,0,0,0,0,0,0,0,0,0,0,0,0,0,0,0,0,0,0,0,0,0,0,0,0,0,0,0,0,0,0,0,0,0,0,0,0,0,null,1,0,0,"","p","p",0]
["",0,0,0,0,null,null,null,null,null,"",{"$error":"#VALUE!"},"",{"$error":"#VALUE!"},"",{"$error":"#VALUE!"},"","","",{"$f":"IF(V196>0,COUNTIF(Q$7:Q196,\"=\"&Q196)-1,\"\")","v":""},"",0,0,0,0,0,0,0,0,0,0,0,0,0,0,0,0,0,0,0,0,0,0,0,0,0,0,0,0,0,0,0,0,0,0,0,0,0,0,0,0,0,0,0,0,0,0,0,0,0,0,0,0,0,0,0,0,0,0,0,0,0,0,0,0,0,0,0,0,0,0,0,0,0,0,0,0,0,0,0,null,1,0,0,"","p","p",0]
["",0,0,0,0,null,null,null,null,null,"",{"$error":"#VALUE!"},"",{"$error":"#VALUE!"},"",{"$error":"#VALUE!"},"","","",{"$f":"IF(V197>0,COUNTIF(Q$7:Q197,\"=\"&Q197)-1,\"\")","v":""},"",0,{"$f":"$V197-LEN(SUBSTITUTE($J197,W$4,\"\"))","v":0},0,0,0,0,{"$f":"IF($CZ197>0,$V197-LEN(SUBSTITUTE($J197,AB$4,\"\")),0)","v":0},0,0,0,0,0,0,0,0,0,{"$f":"IF($CZ197>0,$V197-LEN(SUBSTITUTE($J197,AL$4,\"\")),0)","v":0},0,0,0,0,0,0,0,0,0,{"$f":"IF($CZ197>0,$V197-LEN(SUBSTITUTE($J197,AV$4,\"\")),0)","v":0},0,0,0,0,0,0,0,0,0,0,0,0,{"$f":"IF($CZ197>0,$V197-LEN(SUBSTITUTE($J197,BI$4,\"\")),0)","v":0},0,0,0,0,0,0,0,0,0,{"$f":"IF($CZ197>0,$V197-LEN(SUBSTITUTE($J197,BS$4,\"\")),0)","v":0},0,0,0,0,0,0,0,0,0,{"$f":"IF($CZ197>0,$V197-LEN(SUBSTITUTE($J197,CC$4,\"\")),0)","v":0},0,0,0,0,0,0,0,0,0,0,0,0,0,0,0,0,0,0,0,null,1,0,0,"","p","p",0]
["",0,0,0,0,null,null,null,null,null,"",{"$error":"#VALUE!"},"",{"$error":"#VALUE!"},"",{"$error":"#VALUE!"},"","","",{"$f":"IF(V198>0,COUNTIF(Q$7:Q198,\"=\"&Q198)-1,\"\")","v":""},"",0,0,0,0,0,0,0,0,0,0,0,0,0,0,0,0,0,0,0,0,0,0,0,0,0,0,0,0,0,0,0,0,0,0,0,0,0,0,0,0,0,0,0,0,0,0,0,0,0,0,0,0,0,0,0,0,0,0,0,0,0,0,0,0,0,0,0,0,0,0,0,0,0,0,0,0,0,0,0,null,1,0,0,"","p","p",0]
[{"$f":"IF(V199=0,\"\",A198+1)","v":""},0,{"$f":"IF($C$2=\"forced-OH\",-1,IF($G199=1,$C$3,IF($G199=2,$D$3,0)))","v":0},{"$f":"IF($F199=1,VLOOKUP($B$2,$DE$5:$DI$11,5,FALSE),0)","v":0},{"$f":"IF($F199=1,VLOOKUP($B$2,$DE$5:$DG$11,3,FALSE),0)","v":0},null,null,null,null,null,{"$f":"IF(V199=0,\"\",SUMPRODUCT(W$5:CY$5,W199:CY199))","v":""},{"$f":"IF(C199=-1,\"\",K199-18.01528)","v":{"$error":"#VALUE!"}},{"$f":"IF(V199=0,\"\",SUMPRODUCT(W$6:CY$6,W199:CY199))","v":""},{"$f":"IF(C199=-1,\"\",M199-18.0105646861)","v":{"$error":"#VALUE!"}},{"$f":"IF(V199=0,\"\",M199+TRUNC(K199-M199-0.1))","v":""},{"$f":"IF(C199=-1,\"\",O199-18.0105646861)","v":{"$error":"#VALUE!"}},{"$f":"IF(V199>0,ROUND(K199,4),\"\")","v":""},{"$f":"IF(V199>0,S199+T199,\"\")","v":""},{"$f":"IF(V199>0,COUNTIF(Q$7:Q$651,\"<\"&Q199)+1,\"\")","v":""},{"$f":"IF(V199>0,COUNTIF(Q$7:Q199,\"=\"&Q199)-1,\"\")","v":""},{"$f":"IF(V199>0,$R$6-R199+1,\"\")","v":""},{"$f":"LEN(J199)","v":0},0,0,0,0,0,0,0,0,0,0,0,0,0,0,0,0,0,0,0,0,0,0,0,0,0,0,0,0,0,0,0,0,0,0,0,0,0,{"$f":"IF($CZ199>0,$V199-LEN(SUBSTITUTE($J199,BH$4,\"\")),0)+DD199","v":0},0,0,0,0,0,0,0,0,0,0,0,0,0,0,0,0,0,0,0,0,0,0,0,0,0,0,0,0,0,0,0,0,0,0,0,{"$f":"IF($CZ199>0,$V199-LEN(SUBSTITUTE($J199,CR$4,\"\")),0)","v":0},0,0,0,{"$f":"V199+B199+C199","v":0},null,{"$f":"-(V199-1)+D199","v":1},{"$f":"E199","v":0},{"$f":"$V199-$W199-$X199-$Z199-$AA199","v":0},"",{"$f":"IF($C199=0,\"p\",\"\")","v":"p"},{"$f":"DA199&J199&DB199","v":"p"},{"$f":"IF($F199=1,VLOOKUP($B$2,$DE$5:$DH$11,4,FALSE),0)","v":0}]
["",{"$f":"IF($F200=1,VLOOKUP($B$2,$DE$5:$DG$11,2,FALSE),IF($F200=2,VLOOKUP($B$3,$DE$5:$DG$6,2,FALSE),0))","v":0},0,0,0,null,null,null,null,null,"",{"$error":"#VALUE!"},"",{"$error":"#VALUE!"},"",{"$error":"#VALUE!"},"","","",{"$f":"IF(V200>0,COUNTIF(Q$7:Q200,\"=\"&Q200)-1,\"\")","v":""},"",0,0,0,0,0,0,0,0,0,0,0,0,0,0,0,0,0,0,0,0,0,0,0,0,0,0,0,0,0,0,0,0,0,0,0,0,0,0,0,0,0,0,0,0,0,0,0,0,0,0,0,0,0,0,0,0,0,0,0,0,0,0,0,0,0,0,0,0,0,0,0,0,0,0,0,0,0,0,0,null,1,0,0,{"$f":"IF($B200=0,\"\",IF(F200=1,LEFT($B$2,LEN($B$2)-1),LEFT($B$3,LEN($B$3)-1)))","v":""},"p","p",0]
["",0,0,0,0,null,null,null,null,null,"",{"$error":"#VALUE!"},"",{"$error":"#VALUE!"},"",{"$error":"#VALUE!"},"","","",{"$f":"IF(V201>0,COUNTIF(Q$7:Q201,\"=\"&Q201)-1,\"\")","v":""},"",0,0,0,0,0,0,0,0,0,0,0,0,0,0,0,0,0,0,0,0,0,0,0,0,0,0,0,0,0,0,0,0,0,0,0,0,0,0,0,0,0,0,0,0,0,0,0,0,0,0,0,0,0,0,0,0,0,0,0,0,0,0,0,0,0,0,0,0,0,0,0,0,0,0,0,0,0,0,0,null,1,0,0,"","p","p",0]
["",0,0,0,0,null,null,null,null,null,"",{"$error":"#VALUE!"},"",{"$error":"#VALUE!"},"",{"$error":"#VALUE!"},"","","",{"$f":"IF(V202>0,COUNTIF(Q$7:Q202,\"=\"&Q202)-1,\"\")","v":""},"",0,0,0,0,0,0,0,0,0,0,0,0,0,0,0,0,0,0,0,0,0,0,0,0,0,0,0,0,0,0,0,0,0,0,0,0,0,0,0,0,0,0,0,0,0,0,0,0,0,0,0,0,0,0,0,0,0,0,0,0,0,0,0,0,0,0,0,0,0,0,0,0,0,0,0,0,0,0,0,null,1,0,0,"","p","p",0]
["",0,0,0,0,null,null,null,null,null,"",{"$error":"#VALUE!"},"",{"$error":"#VALUE!"},"",{"$error":"#VALUE!"},"","","",{"$f":"IF(V203>0,COUNTIF(Q$7:Q203,\"=\"&Q203)-1,\"\")","v":""},"",0,0,0,0,0,0,0,0,0,0,0,0,0,0,0,0,0,0,0,0,0,0,0,0,0,0,0,0,0,0,0,0,0,0,0,0,0,0,0,0,0,0,0,0,0,0,0,0,0,0,0,0,0,0,0,0,0,0,0,0,0,0,0,0,0,0,0,0,0,0,0,0,0,0,0,0,0,0,0,null,1,0,0,"","p","p",0]
["",0,0,0,0,null,null,null,null,null,"",{"$error":"#VALUE!"},"",{"$error":"#VALUE!"},"",{"$error":"#VALUE!"},"","","",{"$f":"IF(V204>0,COUNTIF(Q$7:Q204,\"=\"&Q204)-1,\"\")","v":""},"",0,0,0,0,0,0,0,0,0,0,0,0,0,0,0,0,0,0,0,0,0,0,0,0,0,0,0,0,0,0,0,0,0,0,0,0,0,0,0,0,0,0,0,0,0,0,0,0,0,0,0,0,0,0,0,0,0,0,0,0,0,0,0,0,0,0,0,0,0,0,0,0,0,0,0,0,0,0,0,null,1,0,0,"","p","p",0]
["",0,0,0,0,null,null,null,null,null,"",{"$error":"#VALUE!"},"",{"$error":"#VALUE!"},"",{"$error":"#VALUE!"},"","","",{"$f":"IF(V205>0,COUNTIF(Q$7:Q205,\"=\"&Q205)-1,\"\")","v":""},"",0,0,0,0,0,0,0,0,0,0,0,0,0,0,0,0,0,0,0,0,0,0,0,0,0,0,0,0,0,0,0,0,0,0,0,0,0,0,0,0,0,0,0,0,0,0,0,0,0,0,0,0,0,0,0,0,0,0,0,0,0,0,0,0,0,0,0,0,0,0,0,0,0,0,0,0,0,0,0,null,1,0,0,"","p","p",0]
["",0,0,0,0,null,null,null,null,null,"",{"$error":"#VALUE!"},"",{"$error":"#VALUE!"},"",{"$error":"#VALUE!"},"","","",{"$f":"IF(V206>0,COUNTIF(Q$7:Q206,\"=\"&Q206)-1,\"\")","v":""},"",0,0,0,0,0,0,0,0,0,0,0,0,0,0,0,0,0,0,0,0,0,0,0,0,0,0,0,0,0,0,0,0,0,0,0,0,0,0,0,0,0,0,0,0,0,0,0,0,0,0,0,0,0,0,0,0,0,0,0,0,0,0,0,0,0,0,0,0,0,0,0,0,0,0,0,0,0,0,0,null,1,0,0,"","p","p",0]
["",0,0,0,0,null,null,null,null,null,"",{"$error":"#VALUE!"},"",{"$error":"#VALUE!"},"",{"$error":"#VALUE!"},"","","",{"$f":"IF(V207>0,COUNTIF(Q$7:Q207,\"=\"&Q207)-1,\"\")","v":""},"",0,{"$f":"$V207-LEN(SUBSTITUTE($J207,W$4,\"\"))","v":0},0,0,0,0,{"$f":"IF($CZ207>0,$V207-LEN(SUBSTITUTE($J207,AB$4,\"\")),0)","v":0},0,0,0,0,0,0,0,0,0,{"$f":"IF($CZ207>0,$V207-LEN(SUBSTITUTE($J207,AL$4,\"\")),0)","v":0},0,0,0,0,0,0,0,0,0,{"$f":"IF($CZ207>0,$V207-LEN(SUBSTITUTE($J207,AV$4,\"\")),0)","v":0},0,0,0,0,0,0,0,0,0,0,0,0,{"$f":"IF($CZ207>0,$V207-LEN(SUBSTITUTE($J207,BI$4,\"\")),0)","v":0},0,0,0,0,0,0,0,0,0,{"$f":"IF($CZ207>0,$V207-LEN(SUBSTITUTE($J207,BS$4,\"\")),0)","v":0},0,0,0,0,0,0,0,0,0,{"$f":"IF($CZ207>0,$V207-LEN(SUBSTITUTE($J207,CC$4,\"\")),0)","v":0},0,0,0,0,0,0,0,0,0,0,{"$f":"IF($CZ207>0,$V207-LEN(SUBSTITUTE($J207,CN$4,\"\")),0)","v":0},0,0,0,0,0,0,0,0,null,1,0,0,"","p","p",0]
["",0,0,0,0,null,null,null,null,null,"",{"$error":"#VALUE!"},"",{"$error":"#VALUE!"},"",{"$error":"#VALUE!"},"","","",{"$f":"IF(V208>0,COUNTIF(Q$7:Q208,\"=\"&Q208)-1,\"\")","v":""},"",0,0,0,0,0,0,0,0,0,0,0,0,0,0,0,0,0,0,0,0,0,0,0,0,0,0,0,0,0,0,0,0,0,0,0,0,0,0,0,0,0,0,0,0,0,0,0,0,0,0,0,0,0,0,0,0,0,0,0,0,0,0,0,0,0,0,0,0,0,0,0,0,0,0,0,0,0,0,0,null,1,0,0,"","p","p",0]
["",0,0,0,0,null,null,null,null,null,"",{"$error":"#VALUE!"},"",{"$error":"#VALUE!"},"",{"$error":"#VALUE!"},"","","",{"$f":"IF(V209>0,COUNTIF(Q$7:Q209,\"=\"&Q209)-1,\"\")","v":""},"",0,0,0,0,0,0,0,0,0,0,0,0,0,0,0,0,0,0,0,0,0,0,0,0,0,0,0,0,0,0,0,0,0,0,0,0,0,0,0,0,0,0,0,0,0,0,0,0,0,0,0,0,0,0,0,0,0,0,0,0,0,0,0,0,0,0,0,0,0,0,0,0,0,0,0,0,0,0,0,null,1,0,0,"","p","p",0]
["",0,0,0,0,null,null,null,null,null,"",{"$error":"#VALUE!"},"",{"$error":"#VALUE!"},"",{"$error":"#VALUE!"},"","","",{"$f":"IF(V210>0,COUNTIF(Q$7:Q210,\"=\"&Q210)-1,\"\")","v":""},"",0,0,0,0,0,0,0,0,0,0,0,0,0,0,0,0,0,0,0,0,0,0,0,0,0,0,0,0,0,0,0,0,0,0,0,0,0,0,0,0,0,0,0,0,0,0,0,0,0,0,0,0,0,0,0,0,0,0,0,0,0,0,0,0,0,0,0,0,0,0,0,0,0,0,0,0,0,0,0,null,1,0,0,"","p","p",0]
["",0,0,0,0,null,null,null,null,null,"",{"$error":"#VALUE!"},"",{"$error":"#VALUE!"},"",{"$error":"#VALUE!"},"","","",{"$f":"IF(V211>0,COUNTIF(Q$7:Q211,\"=\"&Q211)-1,\"\")","v":""},"",0,0,0,0,0,0,0,0,0,0,0,0,0,0,0,0,0,0,0,0,0,0,0,0,0,0,0,0,0,0,0,0,0,0,0,0,0,0,0,0,0,0,0,0,0,0,0,0,0,0,0,0,0,0,0,0,0,0,0,0,0,0,0,0,0,0,0,0,0,0,0,0,0,0,0,0,0,0,0,null,1,0,0,"","p","p",0]
["",0,0,0,0,null,null,null,null,null,"",{"$error":"#VALUE!"},"",{"$error":"#VALUE!"},"",{"$error":"#VALUE!"},"","","",{"$f":"IF(V212>0,COUNTIF(Q$7:Q212,\"=\"&Q212)-1,\"\")","v":""},"",0,0,0,0,0,0,0,0,0,0,0,0,0,0,0,0,0,0,0,0,0,0,0,0,0,0,0,0,0,0,0,0,0,0,0,0,0,0,0,0,0,0,0,0,0,0,0,0,0,0,0,0,0,0,0,0,0,0,0,0,0,0,0,0,0,0,0,0,0,0,0,0,0,0,0,0,0,0,0,null,1,0,0,"","p","p",0]
["",0,0,0,0,null,null,null,null,null,"",{"$error":"#VALUE!"},"",{"$error":"#VALUE!"},"",{"$error":"#VALUE!"},"","","",{"$f":"IF(V213>0,COUNTIF(Q$7:Q213,\"=\"&Q213)-1,\"\")","v":""},"",0,0,0,0,0,0,0,0,0,0,0,0,0,0,0,0,0,0,0,0,0,0,0,0,0,0,0,0,0,0,0,0,0,0,0,0,0,0,0,0,0,0,0,0,0,0,0,0,0,0,0,0,0,0,0,0,0,0,0,0,0,0,0,0,0,0,0,0,0,0,0,0,0,0,0,0,0,0,0,null,1,0,0,"","p","p",0]
["",0,0,0,0,null,null,null,null,null,"",{"$error":"#VALUE!"},"",{"$error":"#VALUE!"},"",{"$error":"#VALUE!"},"","","",{"$f":"IF(V214>0,COUNTIF(Q$7:Q214,\"=\"&Q214)-1,\"\")","v":""},"",0,0,0,0,0,0,0,0,0,0,0,0,0,0,0,0,0,0,0,0,0,0,0,0,0,0,0,0,0,0,0,0,0,0,0,0,0,0,0,0,0,0,0,0,0,0,0,0,0,0,0,0,0,0,0,0,0,0,0,0,0,0,0,0,0,0,0,0,0,0,0,0,0,0,0,0,0,0,0,null,1,0,0,"","p","p",0]
["",0,0,0,0,null,null,null,null,null,"",{"$error":"#VALUE!"},"",{"$error":"#VALUE!"},"",{"$error":"#VALUE!"},"","","",{"$f":"IF(V215>0,COUNTIF(Q$7:Q215,\"=\"&Q215)-1,\"\")","v":""},"",0,0,0,0,0,0,0,0,0,0,0,0,0,0,0,0,0,0,0,0,0,0,0,0,0,0,0,0,0,0,0,0,0,0,0,0,0,0,0,0,0,0,0,0,0,0,0,0,0,0,0,0,0,0,0,0,0,0,0,0,0,0,0,0,0,0,0,0,0,0,0,0,0,0,{"$f":"IF($CZ215>0,$V215-LEN(SUBSTITUTE($J215,CR$4,\"\")),0)","v":0},0,0,0,0,null,1,0,0,"","p","p",0]
["",0,0,0,0,null,null,null,null,null,"",{"$error":"#VALUE!"},"",{"$error":"#VALUE!"},"",{"$error":"#VALUE!"},"","","",{"$f":"IF(V216>0,COUNTIF(Q$7:Q216,\"=\"&Q216)-1,\"\")","v":""},"",0,0,0,0,0,0,0,0,0,0,0,0,0,0,0,0,0,0,0,0,0,0,0,0,0,0,0,0,0,0,0,0,0,0,0,0,0,0,0,0,0,0,0,0,0,0,0,0,0,0,0,0,0,0,0,0,0,0,0,0,0,0,0,0,0,0,0,0,0,0,0,0,0,0,0,0,0,0,0,null,1,0,0,"","p","p",0]
["",0,0,0,0,null,null,null,null,null,"",{"$error":"#VALUE!"},"",{"$error":"#VALUE!"},"",{"$error":"#VALUE!"},"","","",{"$f":"IF(V217>0,COUNTIF(Q$7:Q217,\"=\"&Q217)-1,\"\")","v":""},"",0,{"$f":"$V217-LEN(SUBSTITUTE($J217,W$4,\"\"))","v":0},0,0,0,0,{"$f":"IF($CZ217>0,$V217-LEN(SUBSTITUTE($J217,AB$4,\"\")),0)","v":0},0,0,0,0,0,0,0,0,0,{"$f":"IF($CZ217>0,$V217-LEN(SUBSTITUTE($J217,AL$4,\"\")),0)","v":0},0,0,0,0,0,0,0,0,0,{"$f":"IF($CZ217>0,$V217-LEN(SUBSTITUTE($J217,AV$4,\"\")),0)","v":0},0,0,0,0,0,0,0,0,0,0,0,0,{"$f":"IF($CZ217>0,$V217-LEN(SUBSTITUTE($J217,BI$4,\"\")),0)","v":0},0,0,0,0,0,0,0,0,0,{"$f":"IF($CZ217>0,$V217-LEN(SUBSTITUTE($J217,BS$4,\"\")),0)","v":0},0,0,0,0,0,0,0,0,0,{"$f":"IF($CZ217>0,$V217-LEN(SUBSTITUTE($J217,CC$4,\"\")),0)","v":0},0,0,0,0,0,0,0,0,0,0,0,0,0,0,0,0,0,0,0,null,1,0,0,"","p","p",0]
["",0,0,0,0,null,null,null,null,null,"",{"$error":"#VALUE!"},"",{"$error":"#VALUE!"},"",{"$error":"#VALUE!"},"","","",{"$f":"IF(V218>0,COUNTIF(Q$7:Q218,\"=\"&Q218)-1,\"\")","v":""},"",0,0,0,0,0,0,0,0,0,0,0,0,0,0,0,0,0,0,0,0,0,0,0,0,0,0,0,0,0,0,0,0,0,0,0,0,0,0,0,0,0,0,0,0,0,0,0,0,0,0,0,0,0,0,0,0,0,0,0,0,0,0,0,0,0,0,0,0,0,0,0,0,0,0,0,0,0,0,0,null,1,0,0,"","p","p",0]
["",0,0,0,0,null,null,null,null,null,"",{"$error":"#VALUE!"},"",{"$error":"#VALUE!"},"",{"$error":"#VALUE!"},"","","",{"$f":"IF(V219>0,COUNTIF(Q$7:Q219,\"=\"&Q219)-1,\"\")","v":""},"",0,0,0,0,0,0,0,0,0,0,0,0,0,0,0,0,0,0,0,0,0,0,0,0,0,0,0,0,0,0,0,0,0,0,0,0,0,0,0,0,0,0,0,0,0,0,0,0,0,0,0,0,0,0,0,0,0,0,0,0,0,0,0,0,0,0,0,0,0,0,0,0,0,0,0,0,0,0,0,null,1,0,0,"","p","p",0]
["",0,0,0,0,null,null,null,null,null,"",{"$error":"#VALUE!"},"",{"$error":"#VALUE!"},"",{"$error":"#VALUE!"},"","","",{"$f":"IF(V220>0,COUNTIF(Q$7:Q220,\"=\"&Q220)-1,\"\")","v":""},"",0,0,0,0,0,0,0,0,0,0,0,0,0,0,0,0,0,0,0,0,0,0,0,0,0,0,0,0,0,0,0,0,0,0,0,0,0,0,0,0,0,0,0,0,0,0,0,0,0,0,0,0,0,0,0,0,0,0,0,0,0,0,0,0,0,0,0,0,0,0,0,0,0,0,0,0,0,0,0,null,1,0,0,"","p","p",0]
["",0,0,0,0,null,null,null,null,null,"",{"$error":"#VALUE!"},"",{"$error":"#VALUE!"},"",{"$error":"#VALUE!"},"","","",{"$f":"IF(V221>0,COUNTIF(Q$7:Q221,\"=\"&Q221)-1,\"\")","v":""},"",0,0,0,0,0,0,0,0,0,0,0,0,0,0,0,0,0,0,0,0,0,0,0,0,0,0,0,0,0,0,0,0,0,0,0,0,0,0,0,0,0,0,0,0,0,0,0,0,0,0,0,0,0,0,0,0,0,0,0,0,0,0,0,0,0,0,0,0,0,0,0,0,0,0,0,0,0,0,0,null,1,0,0,"","p","p",0]
["",0,0,0,0,null,null,null,null,null,"",{"$error":"#VALUE!"},"",{"$error":"#VALUE!"},"",{"$error":"#VALUE!"},"","","",{"$f":"IF(V222>0,COUNTIF(Q$7:Q222,\"=\"&Q222)-1,\"\")","v":""},"",0,0,0,0,0,0,0,0,0,0,0,0,0,0,0,0,0,0,0,0,0,0,0,0,0,0,0,0,0,0,0,0,0,0,0,0,0,0,0,0,0,0,0,0,0,0,0,0,0,0,0,0,0,0,0,0,0,0,0,0,0,0,0,0,0,0,0,0,0,0,0,0,0,0,0,0,0,0,0,null,1,0,0,"","p","p",0]
["",0,0,0,0,null,null,null,null,null,"",{"$error":"#VALUE!"},"",{"$error":"#VALUE!"},"",{"$error":"#VALUE!"},"","","",{"$f":"IF(V223>0,COUNTIF(Q$7:Q223,\"=\"&Q223)-1,\"\")","v":""},"",0,0,0,0,0,0,0,0,0,0,0,0,0,0,0,0,0,0,0,0,0,0,0,0,0,0,0,0,0,0,0,0,0,0,0,0,0,0,0,0,0,0,0,0,0,0,0,0,0,0,0,0,0,0,0,0,0,0,0,0,0,0,0,0,0,0,0,0,0,0,0,0,0,0,0,0,0,0,0,null,1,0,0,"","p","p",0]
["",0,0,0,0,null,null,null,null,null,"",{"$error":"#VALUE!"},"",{"$error":"#VALUE!"},"",{"$error":"#VALUE!"},"","","",{"$f":"IF(V224>0,COUNTIF(Q$7:Q224,\"=\"&Q224)-1,\"\")","v":""},"",0,0,0,0,0,0,0,0,0,0,0,0,0,0,0,0,0,0,0,0,0,0,0,0,0,0,0,0,0,0,0,0,0,0,0,0,0,0,0,0,0,0,0,0,0,0,0,0,0,0,0,0,0,0,0,0,0,0,0,0,0,0,0,0,0,0,0,0,0,0,0,0,0,0,0,0,0,0,0,null,1,0,0,"","p","p",0]
["",0,0,0,0,null,null,null,null,null,"",{"$error":"#VALUE!"},"",{"$error":"#VALUE!"},"",{"$error":"#VALUE!"},"","","",{"$f":"IF(V225>0,COUNTIF(Q$7:Q225,\"=\"&Q225)-1,\"\")","v":""},"",0,0,0,0,0,0,0,0,0,0,0,0,0,0,0,0,0,0,0,0,0,0,0,0,0,0,0,0,0,0,0,0,0,0,0,0,0,0,0,0,0,0,0,0,0,0,0,0,0,0,0,0,0,0,0,0,0,0,0,0,0,0,0,0,0,0,0,0,0,0,0,0,0,0,0,0,0,0,0,null,1,0,0,"","p","p",0]
["",0,0,0,0,null,null,null,null,null,"",{"$error":"#VALUE!"},"",{"$error":"#VALUE!"},"",{"$error":"#VALUE!"},"","","",{"$f":"IF(V226>0,COUNTIF(Q$7:Q226,\"=\"&Q226)-1,\"\")","v":""},"",0,0,0,0,0,0,0,0,0,0,0,0,0,0,0,0,0,0,0,0,0,0,0,0,0,0,0,0,0,0,0,0,0,0,0,0,0,0,0,0,0,0,0,0,0,0,0,0,0,0,0,0,0,0,0,0,0,0,0,0,0,0,0,0,0,0,0,0,0,0,0,0,0,0,0,0,0,0,0,null,1,0,0,"","p","p",0]
["",0,0,0,0,null,null,null,null,null,"",{"$error":"#VALUE!"},"",{"$error":"#VALUE!"},"",{"$error":"#VALUE!"},"","","",{"$f":"IF(V227>0,COUNTIF(Q$7:Q227,\"=\"&Q227)-1,\"\")","v":""},"",0,{"$f":"$V227-LEN(SUBSTITUTE($J227,W$4,\"\"))","v":0},0,0,0,0,{"$f":"IF($CZ227>0,$V227-LEN(SUBSTITUTE($J227,AB$4,\"\")),0)","v":0},0,0,0,0,0,0,0,0,0,{"$f":"IF($CZ227>0,$V227-LEN(SUBSTITUTE($J227,AL$4,\"\")),0)","v":0},0,0,0,0,0,0,0,0,0,{"$f":"IF($CZ227>0,$V227-LEN(SUBSTITUTE($J227,AV$4,\"\")),0)","v":0},0,0,0,0,0,0,0,0,0,0,0,0,{"$f":"IF($CZ227>0,$V227-LEN(SUBSTITUTE($J227,BI$4,\"\")),0)","v":0},0,0,0,0,0,0,0,0,0,{"$f":"IF($CZ227>0,$V227-LEN(SUBSTITUTE($J227,BS$4,\"\")),0)","v":0},0,0,0,0,0,0,0,0,0,{"$f":"IF($CZ227>0,$V227-LEN(SUBSTITUTE($J227,CC$4,\"\")),0)","v":0},0,0,0,0,0,0,0,0,0,0,{"$f":"IF($CZ227>0,$V227-LEN(SUBSTITUTE($J227,CN$4,\"\")),0)","v":0},0,0,0,0,0,0,0,0,null,1,0,0,"","p","p",0]
["",0,0,0,0,null,null,null,null,null,"",{"$error":"#VALUE!"},"",{"$error":"#VALUE!"},"",{"$error":"#VALUE!"},"","","",{"$f":"IF(V228>0,COUNTIF(Q$7:Q228,\"=\"&Q228)-1,\"\")","v":""},"",0,0,0,0,0,0,0,0,0,0,0,0,0,0,0,0,0,0,0,0,0,0,0,0,0,0,0,0,0,0,0,0,0,0,0,0,0,0,0,0,0,0,0,0,0,0,0,0,0,0,0,0,0,0,0,0,0,0,0,0,0,0,0,0,0,0,0,0,0,0,0,0,0,0,0,0,0,0,0,null,1,0,0,"","p","p",0]
["",0,0,0,0,null,null,null,null,null,"",{"$error":"#VALUE!"},"",{"$error":"#VALUE!"},"",{"$error":"#VALUE!"},"","","",{"$f":"IF(V229>0,COUNTIF(Q$7:Q229,\"=\"&Q229)-1,\"\")","v":""},"",0,0,0,0,0,0,0,0,0,0,0,0,0,0,0,0,0,0,0,0,0,0,0,0,0,0,0,0,0,0,0,0,0,0,0,0,0,0,0,0,0,0,0,0,0,0,0,0,0,0,0,0,0,0,0,0,0,0,0,0,0,0,0,0,0,0,0,0,0,0,0,0,0,0,0,0,0,0,0,null,1,0,0,"","p","p",0]
["",0,0,0,0,null,null,null,null,null,"",{"$error":"#VALUE!"},"",{"$error":"#VALUE!"},"",{"$error":"#VALUE!"},"","","",{"$f":"IF(V230>0,COUNTIF(Q$7:Q230,\"=\"&Q230)-1,\"\")","v":""},"",0,0,0,0,0,0,0,0,0,0,0,0,0,0,0,0,0,0,0,0,0,0,0,0,0,0,0,0,0,0,0,0,0,0,0,0,0,0,0,0,0,0,0,0,0,0,0,0,0,0,0,0,0,0,0,0,0,0,0,0,0,0,0,0,0,0,0,0,0,0,0,0,0,0,0,0,0,0,0,null,1,0,0,"","p","p",0]
["",0,0,0,0,null,null,null,null,null,"",{"$error":"#VALUE!"},"",{"$error":"#VALUE!"},"",{"$error":"#VALUE!"},"","","",{"$f":"IF(V231>0,COUNTIF(Q$7:Q231,\"=\"&Q231)-1,\"\")","v":""},"",0,0,0,0,0,0,0,0,0,0,0,0,0,0,0,0,0,0,0,0,0,0,0,0,0,0,0,0,0,0,0,0,0,0,0,0,0,0,0,0,0,0,0,0,0,0,0,0,0,0,0,0,0,0,0,0,0,0,0,0,0,0,0,0,0,0,0,0,0,0,0,0,0,0,{"$f":"IF($CZ231>0,$V231-LEN(SUBSTITUTE($J231,CR$4,\"\")),0)","v":0},0,0,0,0,null,1,0,0,"","p","p",0]
["",0,0,0,0,null,null,null,null,null,"",{"$error":"#VALUE!"},"",{"$error":"#VALUE!"},"",{"$error":"#VALUE!"},"","","",{"$f":"IF(V232>0,COUNTIF(Q$7:Q232,\"=\"&Q232)-1,\"\")","v":""},"",0,0,0,0,0,0,0,0,0,0,0,0,0,0,0,0,0,0,0,0,0,0,0,0,0,0,0,0,0,0,0,0,0,0,0,0,0,0,0,0,0,0,0,0,0,0,0,0,0,0,0,0,0,0,0,0,0,0,0,0,0,0,0,0,0,0,0,0,0,0,0,0,0,0,0,0,0,0,0,null,1,0,0,"","p","p",0]
["",0,0,0,0,null,null,null,null,null,"",{"$error":"#VALUE!"},"",{"$error":"#VALUE!"},"",{"$error":"#VALUE!"},"","","",{"$f":"IF(V233>0,COUNTIF(Q$7:Q233,\"=\"&Q233)-1,\"\")","v":""},"",0,0,0,0,0,0,0,0,0,0,0,0,0,0,0,0,0,0,0,0,0,0,0,0,0,0,0,0,0,0,0,0,0,0,0,0,0,0,0,0,0,0,0,0,0,0,0,0,0,0,0,0,0,0,0,0,0,0,0,0,0,0,0,0,0,0,0,0,0,0,0,0,0,0,0,0,0,0,0,null,1,0,0,"","p","p",0]
["",0,0,0,0,null,null,null,null,null,"",{"$error":"#VALUE!"},"",{"$error":"#VALUE!"},"",{"$error":"#VALUE!"},"","","",{"$f":"IF(V234>0,COUNTIF(Q$7:Q234,\"=\"&Q234)-1,\"\")","v":""},"",0,0,0,0,0,0,0,0,0,0,0,0,0,0,0,0,0,0,0,0,0,0,0,0,0,0,0,0,0,0,0,0,0,0,0,0,0,0,0,0,0,0,0,0,0,0,0,0,0,0,0,0,0,0,0,0,0,0,0,0,0,0,0,0,0,0,0,0,0,0,0,0,0,0,0,0,0,0,0,null,1,0,0,"","p","p",0]
["",0,0,0,0,null,null,null,null,null,"",{"$error":"#VALUE!"},"",{"$error":"#VALUE!"},"",{"$error":"#VALUE!"},"","","",{"$f":"IF(V235>0,COUNTIF(Q$7:Q235,\"=\"&Q235)-1,\"\")","v":""},"",0,0,0,0,0,0,0,0,0,0,0,0,0,0,0,0,0,0,0,0,0,0,0,0,0,0,0,0,0,0,0,0,0,0,0,0,0,0,0,0,0,0,0,0,0,0,0,0,0,0,0,0,0,0,0,0,0,0,0,0,0,0,0,0,0,0,0,0,0,0,0,0,0,0,0,0,0,0,0,null,1,0,0,"","p","p",0]
["",0,0,0,0,null,null,null,null,null,"",{"$error":"#VALUE!"},"",{"$error":"#VALUE!"},"",{"$error":"#VALUE!"},"","","",{"$f":"IF(V236>0,COUNTIF(Q$7:Q236,\"=\"&Q236)-1,\"\")","v":""},"",0,0,0,0,0,0,0,0,0,0,0,0,0,0,0,0,0,0,0,0,0,0,0,0,0,0,0,0,0,0,0,0,0,0,0,0,0,0,0,0,0,0,0,0,0,0,0,0,0,0,0,0,0,0,0,0,0,0,0,0,0,0,0,0,0,0,0,0,0,0,0,0,0,0,0,0,0,0,0,null,1,0,0,"","p","p",0]
["",0,0,0,0,null,null,null,null,null,"",{"$error":"#VALUE!"},"",{"$error":"#VALUE!"},"",{"$error":"#VALUE!"},"","","",{"$f":"IF(V237>0,COUNTIF(Q$7:Q237,\"=\"&Q237)-1,\"\")","v":""},"",0,{"$f":"$V237-LEN(SUBSTITUTE($J237,W$4,\"\"))","v":0},0,0,0,0,{"$f":"IF($CZ237>0,$V237-LEN(SUBSTITUTE($J237,AB$4,\"\")),0)","v":0},0,0,0,0,0,0,0,0,0,{"$f":"IF($CZ237>0,$V237-LEN(SUBSTITUTE($J237,AL$4,\"\")),0)","v":0},0,0,0,0,0,0,0,0,0,{"$f":"IF($CZ237>0,$V237-LEN(SUBSTITUTE($J237,AV$4,\"\")),0)","v":0},0,0,0,0,0,0,0,0,0,0,0,0,{"$f":"IF($CZ237>0,$V237-LEN(SUBSTITUTE($J237,BI$4,\"\")),0)","v":0},0,0,0,0,0,0,0,0,0,{"$f":"IF($CZ237>0,$V237-LEN(SUBSTITUTE($J237,BS$4,\"\")),0)","v":0},0,0,0,0,0,0,0,0,0,{"$f":"IF($CZ237>0,$V237-LEN(SUBSTITUTE($J237,CC$4,\"\")),0)","v":0},0,0,0,0,0,0,0,0,0,0,0,0,0,0,0,0,0,0,0,null,1,0,0,"","p","p",0]
["",0,0,0,0,null,null,null,null,null,"",{"$error":"#VALUE!"},"",{"$error":"#VALUE!"},"",{"$error":"#VALUE!"},"","","",{"$f":"IF(V238>0,COUNTIF(Q$7:Q238,\"=\"&Q238)-1,\"\")","v":""},"",0,0,0,0,0,0,0,0,0,0,0,0,0,0,0,0,0,0,0,0,0,0,0,0,0,0,0,0,0,0,0,0,0,0,0,0,0,0,0,0,0,0,0,0,0,0,0,0,0,0,0,0,0,0,0,0,0,0,0,0,0,0,0,0,0,0,0,0,0,0,0,0,0,0,0,0,0,0,0,null,1,0,0,"","p","p",0]
["",0,0,0,0,null,null,null,null,null,"",{"$error":"#VALUE!"},"",{"$error":"#VALUE!"},"",{"$error":"#VALUE!"},"","","",{"$f":"IF(V239>0,COUNTIF(Q$7:Q239,\"=\"&Q239)-1,\"\")","v":""},"",0,0,0,0,0,0,0,0,0,0,0,0,0,0,0,0,0,0,0,0,0,0,0,0,0,0,0,0,0,0,0,0,0,0,0,0,0,0,0,0,0,0,0,0,0,0,0,0,0,0,0,0,0,0,0,0,0,0,0,0,0,0,0,0,0,0,0,0,0,0,0,0,0,0,0,0,0,0,0,null,1,0,0,"","p","p",0]
["",0,0,0,0,null,null,null,null,null,"",{"$error":"#VALUE!"},"",{"$error":"#VALUE!"},"",{"$error":"#VALUE!"},"","","",{"$f":"IF(V240>0,COUNTIF(Q$7:Q240,\"=\"&Q240)-1,\"\")","v":""},"",0,0,0,0,0,0,0,0,0,0,0,0,0,0,0,0,0,0,0,0,0,0,0,0,0,0,0,0,0,0,0,0,0,0,0,0,0,0,0,0,0,0,0,0,0,0,0,0,0,0,0,0,0,0,0,0,0,0,0,0,0,0,0,0,0,0,0,0,0,0,0,0,0,0,0,0,0,0,0,null,1,0,0,"","p","p",0]
["",0,0,0,0,null,null,null,null,null,"",{"$error":"#VALUE!"},"",{"$error":"#VALUE!"},"",{"$error":"#VALUE!"},"","","",{"$f":"IF(V241>0,COUNTIF(Q$7:Q241,\"=\"&Q241)-1,\"\")","v":""},"",0,0,0,0,0,0,0,0,0,0,0,0,0,0,0,0,0,0,0,0,0,0,0,0,0,0,0,0,0,0,0,0,0,0,0,0,0,0,0,0,0,0,0,0,0,0,0,0,0,0,0,0,0,0,0,0,0,0,0,0,0,0,0,0,0,0,0,0,0,0,0,0,0,0,0,0,0,0,0,null,1,0,0,"","p","p",0]
["",0,0,0,0,null,null,null,null,null,"",{"$error":"#VALUE!"},"",{"$error":"#VALUE!"},"",{"$error":"#VALUE!"},"","","",{"$f":"IF(V242>0,COUNTIF(Q$7:Q242,\"=\"&Q242)-1,\"\")","v":""},"",0,0,0,0,0,0,0,0,0,0,0,0,0,0,0,0,0,0,0,0,0,0,0,0,0,0,0,0,0,0,0,0,0,0,0,0,0,0,0,0,0,0,0,0,0,0,0,0,0,0,0,0,0,0,0,0,0,0,0,0,0,0,0,0,0,0,0,0,0,0,0,0,0,0,0,0,0,0,0,null,1,0,0,"","p","p",0]
["",0,0,0,0,null,null,null,null,null,"",{"$error":"#VALUE!"},"",{"$error":"#VALUE!"},"",{"$error":"#VALUE!"},"","","",{"$f":"IF(V243>0,COUNTIF(Q$7:Q243,\"=\"&Q243)-1,\"\")","v":""},"",0,0,0,0,0,0,0,0,0,0,0,0,0,0,0,0,0,0,0,0,0,0,0,0,0,0,0,0,0,0,0,0,0,0,0,0,0,0,0,0,0,0,0,0,0,0,0,0,0,0,0,0,0,0,0,0,0,0,0,0,0,0,0,0,0,0,0,0,0,0,0,0,0,0,0,0,0,0,0,null,1,0,0,"","p","p",0]
["",0,0,0,0,null,null,null,null,null,"",{"$error":"#VALUE!"},"",{"$error":"#VALUE!"},"",{"$error":"#VALUE!"},"","","",{"$f":"IF(V244>0,COUNTIF(Q$7:Q244,\"=\"&Q244)-1,\"\")","v":""},"",0,0,0,0,0,0,0,0,0,0,0,0,0,0,0,0,0,0,0,0,0,0,0,0,0,0,0,0,0,0,0,0,0,0,0,0,0,0,0,0,0,0,0,0,0,0,0,0,0,0,0,0,0,0,0,0,0,0,0,0,0,0,0,0,0,0,0,0,0,0,0,0,0,0,0,0,0,0,0,null,1,0,0,"","p","p",0]
["",0,0,0,0,null,null,null,null,null,"",{"$error":"#VALUE!"},"",{"$error":"#VALUE!"},"",{"$error":"#VALUE!"},"","","",{"$f":"IF(V245>0,COUNTIF(Q$7:Q245,\"=\"&Q245)-1,\"\")","v":""},"",0,0,0,0,0,0,0,0,0,0,0,0,0,0,0,0,0,0,0,0,0,0,0,0,0,0,0,0,0,0,0,0,0,0,0,0,0,0,0,0,0,0,0,0,0,0,0,0,0,0,0,0,0,0,0,0,0,0,0,0,0,0,0,0,0,0,0,0,0,0,0,0,0,0,0,0,0,0,0,null,1,0,0,"","p","p",0]
["",0,0,0,0,null,null,null,null,null,"",{"$error":"#VALUE!"},"",{"$error":"#VALUE!"},"",{"$error":"#VALUE!"},"","","",{"$f":"IF(V246>0,COUNTIF(Q$7:Q246,\"=\"&Q246)-1,\"\")","v":""},"",0,0,0,0,0,0,0,0,0,0,0,0,0,0,0,0,0,0,0,0,0,0,0,0,0,0,0,0,0,0,0,0,0,0,0,0,0,0,0,0,0,0,0,0,0,0,0,0,0,0,0,0,0,0,0,0,0,0,0,0,0,0,0,0,0,0,0,0,0,0,0,0,0,0,0,0,0,0,0,null,1,0,0,"","p","p",0]
["",0,0,0,0,null,null,null,null,null,"",{"$error":"#VALUE!"},"",{"$error":"#VALUE!"},"",{"$error":"#VALUE!"},"","","",{"$f":"IF(V247>0,COUNTIF(Q$7:Q247,\"=\"&Q247)-1,\"\")","v":""},"",0,{"$f":"$V247-LEN(SUBSTITUTE($J247,W$4,\"\"))","v":0},0,0,0,0,{"$f":"IF($CZ247>0,$V247-LEN(SUBSTITUTE($J247,AB$4,\"\")),0)","v":0},0,0,0,0,0,0,0,0,0,{"$f":"IF($CZ247>0,$V247-LEN(SUBSTITUTE($J247,AL$4,\"\")),0)","v":0},0,0,0,0,0,0,0,0,0,{"$f":"IF($CZ247>0,$V247-LEN(SUBSTITUTE($J247,AV$4,\"\")),0)","v":0},0,0,0,0,0,0,0,0,0,0,0,0,{"$f":"IF($CZ247>0,$V247-LEN(SUBSTITUTE($J247,BI$4,\"\")),0)","v":0},0,0,0,0,0,0,0,0,0,{"$f":"IF($CZ247>0,$V247-LEN(SUBSTITUTE($J247,BS$4,\"\")),0)","v":0},0,0,0,0,0,0,0,0,0,{"$f":"IF($CZ247>0,$V247-LEN(SUBSTITUTE($J247,CC$4,\"\")),0)","v":0},0,0,0,0,0,0,0,0,0,0,{"$f":"IF($CZ247>0,$V247-LEN(SUBSTITUTE($J247,CN$4,\"\")),0)","v":0},0,0,0,{"$f":"IF($CZ247>0,$V247-LEN(SUBSTITUTE($J247,CR$4,\"\")),0)","v":0},0,0,0,0,null,1,0,0,"","p","p",0]
["",0,0,0,0,null,null,null,null,null,"",{"$error":"#VALUE!"},"",{"$error":"#VALUE!"},"",{"$error":"#VALUE!"},"","","",{"$f":"IF(V248>0,COUNTIF(Q$7:Q248,\"=\"&Q248)-1,\"\")","v":""},"",0,0,0,0,0,0,0,0,0,0,0,0,0,0,0,0,0,0,0,0,0,0,0,0,0,0,0,0,0,0,0,0,0,0,0,0,0,0,0,0,0,0,0,0,0,0,0,0,0,0,0,0,0,0,0,0,0,0,0,0,0,0,0,0,0,0,0,0,0,0,0,0,0,0,0,0,0,0,0,null,1,0,0,"","p","p",0]
["",0,0,0,0,null,null,null,null,null,"",{"$error":"#VALUE!"},"",{"$error":"#VALUE!"},"",{"$error":"#VALUE!"},"","","",{"$f":"IF(V249>0,COUNTIF(Q$7:Q249,\"=\"&Q249)-1,\"\")","v":""},"",0,0,0,0,0,0,0,0,0,0,0,0,0,0,0,0,0,0,0,0,0,0,0,0,0,0,0,0,0,0,0,0,0,0,0,0,0,0,0,0,0,0,0,0,0,0,0,0,0,0,0,0,0,0,0,0,0,0,0,0,0,0,0,0,0,0,0,0,0,0,0,0,0,0,0,0,0,0,0,null,1,0,0,"","p","p",0]
["",0,0,0,0,null,null,null,null,null,"",{"$error":"#VALUE!"},"",{"$error":"#VALUE!"},"",{"$error":"#VALUE!"},"","","",{"$f":"IF(V250>0,COUNTIF(Q$7:Q250,\"=\"&Q250)-1,\"\")","v":""},"",0,0,0,0,0,0,0,0,0,0,0,0,0,0,0,0,0,0,0,0,0,0,0,0,0,0,0,0,0,0,0,0,0,0,0,0,0,0,0,0,0,0,0,0,0,0,0,0,0,0,0,0,0,0,0,0,0,0,0,0,0,0,0,0,0,0,0,0,0,0,0,0,0,0,0,0,0,0,0,null,1,0,0,"","p","p",0]
["",0,0,0,0,null,null,null,null,null,"",{"$error":"#VALUE!"},"",{"$error":"#VALUE!"},"",{"$error":"#VALUE!"},"","","",{"$f":"IF(V251>0,COUNTIF(Q$7:Q251,\"=\"&Q251)-1,\"\")","v":""},"",0,0,0,0,0,0,0,0,0,0,0,0,0,0,0,0,0,0,0,0,0,0,0,0,0,0,0,0,0,0,0,0,0,0,0,0,0,0,0,0,0,0,0,0,0,0,0,0,0,0,0,0,0,0,0,0,0,0,0,0,0,0,0,0,0,0,0,0,0,0,0,0,0,0,0,0,0,0,0,null,1,0,0,"","p","p",0]
["",0,0,0,0,null,null,null,null,null,"",{"$error":"#VALUE!"},"",{"$error":"#VALUE!"},"",{"$error":"#VALUE!"},"","","",{"$f":"IF(V252>0,COUNTIF(Q$7:Q252,\"=\"&Q252)-1,\"\")","v":""},"",0,0,0,0,0,0,0,0,0,0,0,0,0,0,0,0,0,0,0,0,0,0,0,0,0,0,0,0,0,0,0,0,0,0,0,0,0,0,0,0,0,0,0,0,0,0,0,0,0,0,0,0,0,0,0,0,0,0,0,0,0,0,0,0,0,0,0,0,0,0,0,0,0,0,0,0,0,0,0,null,1,0,0,"","p","p",0]
["",0,0,0,0,null,null,null,null,null,"",{"$error":"#VALUE!"},"",{"$error":"#VALUE!"},"",{"$error":"#VALUE!"},"","","",{"$f":"IF(V253>0,COUNTIF(Q$7:Q253,\"=\"&Q253)-1,\"\")","v":""},"",0,0,0,0,0,0,0,0,0,0,0,0,0,0,0,0,0,0,0,0,0,0,0,0,0,0,0,0,0,0,0,0,0,0,0,0,0,0,0,0,0,0,0,0,0,0,0,0,0,0,0,0,0,0,0,0,0,0,0,0,0,0,0,0,0,0,0,0,0,0,0,0,0,0,0,0,0,0,0,null,1,0,0,"","p","p",0]
["",0,0,0,0,null,null,null,null,null,"",{"$error":"#VALUE!"},"",{"$error":"#VALUE!"},"",{"$error":"#VALUE!"},"","","",{"$f":"IF(V254>0,COUNTIF(Q$7:Q254,\"=\"&Q254)-1,\"\")","v":""},"",0,0,0,0,0,0,0,0,0,0,0,0,0,0,0,0,0,0,0,0,0,0,0,0,0,0,0,0,0,0,0,0,0,0,0,0,0,0,0,0,0,0,0,0,0,0,0,0,0,0,0,0,0,0,0,0,0,0,0,0,0,0,0,0,0,0,0,0,0,0,0,0,0,0,0,0,0,0,0,null,1,0,0,"","p","p",0]
["",0,0,0,0,null,null,null,null,null,"",{"$error":"#VALUE!"},"",{"$error":"#VALUE!"},"",{"$error":"#VALUE!"},"","","",{"$f":"IF(V255>0,COUNTIF(Q$7:Q255,\"=\"&Q255)-1,\"\")","v":""},"",0,0,0,0,0,0,0,0,0,0,0,0,0,0,0,0,0,0,0,0,0,0,0,0,0,0,0,0,0,0,0,0,0,0,0,0,0,0,0,0,0,0,0,0,0,0,0,0,0,0,0,0,0,0,0,0,0,0,0,0,0,0,0,0,0,0,0,0,0,0,0,0,0,0,0,0,0,0,0,null,1,0,0,"","p","p",0]
["",0,0,0,0,null,null,null,null,null,"",{"$error":"#VALUE!"},"",{"$error":"#VALUE!"},"",{"$error":"#VALUE!"},"","","",{"$f":"IF(V256>0,COUNTIF(Q$7:Q256,\"=\"&Q256)-1,\"\")","v":""},"",0,0,0,0,0,0,0,0,0,0,0,0,0,0,0,0,0,0,0,0,0,0,0,0,0,0,0,0,0,0,0,0,0,0,0,0,0,0,0,0,0,0,0,0,0,0,0,0,0,0,0,0,0,0,0,0,0,0,0,0,0,0,0,0,0,0,0,0,0,0,0,0,0,0,0,0,0,0,0,null,1,0,0,"","p","p",0]
["",0,0,0,0,null,null,null,null,null,"",{"$error":"#VALUE!"},"",{"$error":"#VALUE!"},"",{"$error":"#VALUE!"},"","","",{"$f":"IF(V257>0,COUNTIF(Q$7:Q257,\"=\"&Q257)-1,\"\")","v":""},"",0,{"$f":"$V257-LEN(SUBSTITUTE($J257,W$4,\"\"))","v":0},0,0,0,0,{"$f":"IF($CZ257>0,$V257-LEN(SUBSTITUTE($J257,AB$4,\"\")),0)","v":0},0,0,0,0,0,0,0,0,0,{"$f":"IF($CZ257>0,$V257-LEN(SUBSTITUTE($J257,AL$4,\"\")),0)","v":0},0,0,0,0,0,0,0,0,0,{"$f":"IF($CZ257>0,$V257-LEN(SUBSTITUTE($J257,AV$4,\"\")),0)","v":0},0,0,0,0,0,0,0,0,0,0,0,0,{"$f":"IF($CZ257>0,$V257-LEN(SUBSTITUTE($J257,BI$4,\"\")),0)","v":0},0,0,0,0,0,0,0,0,0,{"$f":"IF($CZ257>0,$V257-LEN(SUBSTITUTE($J257,BS$4,\"\")),0)","v":0},0,0,0,0,0,0,0,0,0,{"$f":"IF($CZ257>0,$V257-LEN(SUBSTITUTE($J257,CC$4,\"\")),0)","v":0},0,0,0,0,0,0,0,0,0,0,0,0,0,0,0,0,0,0,0,null,1,0,0,"","p","p",0]
["",0,0,0,0,null,null,null,null,null,"",{"$error":"#VALUE!"},"",{"$error":"#VALUE!"},"",{"$error":"#VALUE!"},"","","",{"$f":"IF(V258>0,COUNTIF(Q$7:Q258,\"=\"&Q258)-1,\"\")","v":""},"",0,0,0,0,0,0,0,0,0,0,0,0,0,0,0,0,0,0,0,0,0,0,0,0,0,0,0,0,0,0,0,0,0,0,0,0,0,0,0,0,0,0,0,0,0,0,0,0,0,0,0,0,0,0,0,0,0,0,0,0,0,0,0,0,0,0,0,0,0,0,0,0,0,0,0,0,0,0,0,null,1,0,0,"","p","p",0]
["",0,0,0,0,null,null,null,null,null,"",{"$error":"#VALUE!"},"",{"$error":"#VALUE!"},"",{"$error":"#VALUE!"},"","","",{"$f":"IF(V259>0,COUNTIF(Q$7:Q259,\"=\"&Q259)-1,\"\")","v":""},"",0,0,0,0,0,0,0,0,0,0,0,0,0,0,0,0,0,0,0,0,0,0,0,0,0,0,0,0,0,0,0,0,0,0,0,0,0,0,0,0,0,0,0,0,0,0,0,0,0,0,0,0,0,0,0,0,0,0,0,0,0,0,0,0,0,0,0,0,0,0,0,0,0,0,0,0,0,0,0,null,1,0,0,"","p","p",0]
["",0,0,0,0,null,null,null,null,null,"",{"$error":"#VALUE!"},"",{"$error":"#VALUE!"},"",{"$error":"#VALUE!"},"","","",{"$f":"IF(V260>0,COUNTIF(Q$7:Q260,\"=\"&Q260)-1,\"\")","v":""},"",0,0,0,0,0,0,0,0,0,0,0,0,0,0,0,0,0,0,0,0,0,0,0,0,0,0,0,0,0,0,0,0,0,0,0,0,0,0,0,0,0,0,0,0,0,0,0,0,0,0,0,0,0,0,0,0,0,0,0,0,0,0,0,0,0,0,0,0,0,0,0,0,0,0,0,0,0,0,0,null,1,0,0,"","p","p",0]
["",0,0,0,0,null,null,null,null,null,"",{"$error":"#VALUE!"},"",{"$error":"#VALUE!"},"",{"$error":"#VALUE!"},"","","",{"$f":"IF(V261>0,COUNTIF(Q$7:Q261,\"=\"&Q261)-1,\"\")","v":""},"",0,0,0,0,0,0,0,0,0,0,0,0,0,0,0,0,0,0,0,0,0,0,0,0,0,0,0,0,0,0,0,0,0,0,0,0,0,0,0,0,0,0,0,0,0,0,0,0,0,0,0,0,0,0,0,0,0,0,0,0,0,0,0,0,0,0,0,0,0,0,0,0,0,0,0,0,0,0,0,null,1,0,0,"","p","p",0]
["",0,0,0,0,null,null,null,null,null,"",{"$error":"#VALUE!"},"",{"$error":"#VALUE!"},"",{"$error":"#VALUE!"},"","","",{"$f":"IF(V262>0,COUNTIF(Q$7:Q262,\"=\"&Q262)-1,\"\")","v":""},"",0,0,0,0,0,0,0,0,0,0,0,0,0,0,0,0,0,0,0,0,0,0,0,0,0,0,0,0,0,0,0,0,0,0,0,0,0,0,0,0,0,0,0,0,0,0,0,0,0,0,0,0,0,0,0,0,0,0,0,0,0,0,0,0,0,0,0,0,0,0,0,0,0,0,0,0,0,0,0,null,1,0,0,"","p","p",0]
[{"$f":"IF(V263=0,\"\",A262+1)","v":""},0,{"$f":"IF($C$2=\"forced-OH\",-1,IF($G263=1,$C$3,IF($G263=2,$D$3,0)))","v":0},{"$f":"IF($F263=1,VLOOKUP($B$2,$DE$5:$DI$11,5,FALSE),0)","v":0},{"$f":"IF($F263=1,VLOOKUP($B$2,$DE$5:$DG$11,3,FALSE),0)","v":0},null,null,null,null,null,{"$f":"IF(V263=0,\"\",SUMPRODUCT(W$5:CY$5,W263:CY263))","v":""},{"$f":"IF(C263=-1,\"\",K263-18.01528)","v":{"$error":"#VALUE!"}},{"$f":"IF(V263=0,\"\",SUMPRODUCT(W$6:CY$6,W263:CY263))","v":""},{"$f":"IF(C263=-1,\"\",M263-18.0105646861)","v":{"$error":"#VALUE!"}},{"$f":"IF(V263=0,\"\",M263+TRUNC(K263-M263-0.1))","v":""},{"$f":"IF(C263=-1,\"\",O263-18.0105646861)","v":{"$error":"#VALUE!"}},{"$f":"IF(V263>0,ROUND(K263,4),\"\")","v":""},{"$f":"IF(V263>0,S263+T263,\"\")","v":""},{"$f":"IF(V263>0,COUNTIF(Q$7:Q$651,\"<\"&Q263)+1,\"\")","v":""},{"$f":"IF(V263>0,COUNTIF(Q$7:Q263,\"=\"&Q263)-1,\"\")","v":""},{"$f":"IF(V263>0,$R$6-R263+1,\"\")","v":""},{"$f":"LEN(J263)","v":0},0,0,0,0,0,0,0,0,0,0,0,0,0,0,0,0,0,0,0,0,0,0,0,0,0,0,0,0,0,0,0,0,0,0,0,0,0,{"$f":"IF($CZ263>0,$V263-LEN(SUBSTITUTE($J263,BH$4,\"\")),0)+DD263","v":0},0,0,0,0,0,0,0,0,0,0,0,0,0,0,0,0,0,0,0,0,0,0,0,0,0,0,0,0,0,0,0,0,0,0,0,{"$f":"IF($CZ263>0,$V263-LEN(SUBSTITUTE($J263,CR$4,\"\")),0)","v":0},0,0,0,{"$f":"V263+B263+C263","v":0},null,{"$f":"-(V263-1)+D263","v":1},{"$f":"E263","v":0},{"$f":"$V263-$W263-$X263-$Z263-$AA263","v":0},"",{"$f":"IF($C263=0,\"p\",\"\")","v":"p"},{"$f":"DA263&J263&DB263","v":"p"},{"$f":"IF($F263=1,VLOOKUP($B$2,$DE$5:$DH$11,4,FALSE),0)","v":0}]
["",{"$f":"IF($F264=1,VLOOKUP($B$2,$DE$5:$DG$11,2,FALSE),IF($F264=2,VLOOKUP($B$3,$DE$5:$DG$6,2,FALSE),0))","v":0},0,0,0,null,null,null,null,null,"",{"$error":"#VALUE!"},"",{"$error":"#VALUE!"},"",{"$error":"#VALUE!"},"","","",{"$f":"IF(V264>0,COUNTIF(Q$7:Q264,\"=\"&Q264)-1,\"\")","v":""},"",0,0,0,0,0,0,0,0,0,0,0,0,0,0,0,0,0,0,0,0,0,0,0,0,0,0,0,0,0,0,0,0,0,0,0,0,0,0,0,0,0,0,0,0,0,0,0,0,0,0,0,0,0,0,0,0,0,0,0,0,0,0,0,0,0,0,0,0,0,0,0,0,0,0,0,0,0,0,0,null,1,0,0,{"$f":"IF($B264=0,\"\",IF(F264=1,LEFT($B$2,LEN($B$2)-1),LEFT($B$3,LEN($B$3)-1)))","v":""},"p","p",0]
["",0,0,0,0,null,null,null,null,null,"",{"$error":"#VALUE!"},"",{"$error":"#VALUE!"},"",{"$error":"#VALUE!"},"","","",{"$f":"IF(V265>0,COUNTIF(Q$7:Q265,\"=\"&Q265)-1,\"\")","v":""},"",0,0,0,0,0,0,0,0,0,0,0,0,0,0,0,0,0,0,0,0,0,0,0,0,0,0,0,0,0,0,0,0,0,0,0,0,0,0,0,0,0,0,0,0,0,0,0,0,0,0,0,0,0,0,0,0,0,0,0,0,0,0,0,0,0,0,0,0,0,0,0,0,0,0,0,0,0,0,0,null,1,0,0,"","p","p",0]
["",0,0,0,0,null,null,null,null,null,"",{"$error":"#VALUE!"},"",{"$error":"#VALUE!"},"",{"$error":"#VALUE!"},"","","",{"$f":"IF(V266>0,COUNTIF(Q$7:Q266,\"=\"&Q266)-1,\"\")","v":""},"",0,0,0,0,0,0,0,0,0,0,0,0,0,0,0,0,0,0,0,0,0,0,0,0,0,0,0,0,0,0,0,0,0,0,0,0,0,0,0,0,0,0,0,0,0,0,0,0,0,0,0,0,0,0,0,0,0,0,0,0,0,0,0,0,0,0,0,0,0,0,0,0,0,0,0,0,0,0,0,null,1,0,0,"","p","p",0]
["",0,0,0,0,null,null,null,null,null,"",{"$error":"#VALUE!"},"",{"$error":"#VALUE!"},"",{"$error":"#VALUE!"},"","","",{"$f":"IF(V267>0,COUNTIF(Q$7:Q267,\"=\"&Q267)-1,\"\")","v":""},"",0,{"$f":"$V267-LEN(SUBSTITUTE($J267,W$4,\"\"))","v":0},0,0,0,0,{"$f":"IF($CZ267>0,$V267-LEN(SUBSTITUTE($J267,AB$4,\"\")),0)","v":0},0,0,0,0,0,0,0,0,0,{"$f":"IF($CZ267>0,$V267-LEN(SUBSTITUTE($J267,AL$4,\"\")),0)","v":0},0,0,0,0,0,0,0,0,0,{"$f":"IF($CZ267>0,$V267-LEN(SUBSTITUTE($J267,AV$4,\"\")),0)","v":0},0,0,0,0,0,0,0,0,0,0,0,0,{"$f":"IF($CZ267>0,$V267-LEN(SUBSTITUTE($J267,BI$4,\"\")),0)","v":0},0,0,0,0,0,0,0,0,0,{"$f":"IF($CZ267>0,$V267-LEN(SUBSTITUTE($J267,BS$4,\"\")),0)","v":0},0,0,0,0,0,0,0,0,0,{"$f":"IF($CZ267>0,$V267-LEN(SUBSTITUTE($J267,CC$4,\"\")),0)","v":0},0,0,0,0,0,0,0,0,0,0,{"$f":"IF($CZ267>0,$V267-LEN(SUBSTITUTE($J267,CN$4,\"\")),0)","v":0},0,0,0,0,0,0,0,0,null,1,0,0,"","p","p",0]
["",0,0,0,0,null,null,null,null,null,"",{"$error":"#VALUE!"},"",{"$error":"#VALUE!"},"",{"$error":"#VALUE!"},"","","",{"$f":"IF(V268>0,COUNTIF(Q$7:Q268,\"=\"&Q268)-1,\"\")","v":""},"",0,0,0,0,0,0,0,0,0,0,0,0,0,0,0,0,0,0,0,0,0,0,0,0,0,0,0,0,0,0,0,0,0,0,0,0,0,0,0,0,0,0,0,0,0,0,0,0,0,0,0,0,0,0,0,0,0,0,0,0,0,0,0,0,0,0,0,0,0,0,0,0,0,0,0,0,0,0,0,null,1,0,0,"","p","p",0]
["",0,0,0,0,null,null,null,null,null,"",{"$error":"#VALUE!"},"",{"$error":"#VALUE!"},"",{"$error":"#VALUE!"},"","","",{"$f":"IF(V269>0,COUNTIF(Q$7:Q269,\"=\"&Q269)-1,\"\")","v":""},"",0,0,0,0,0,0,0,0,0,0,0,0,0,0,0,0,0,0,0,0,0,0,0,0,0,0,0,0,0,0,0,0,0,0,0,0,0,0,0,0,0,0,0,0,0,0,0,0,0,0,0,0,0,0,0,0,0,0,0,0,0,0,0,0,0,0,0,0,0,0,0,0,0,0,0,0,0,0,0,null,1,0,0,"","p","p",0]
["",0,0,0,0,null,null,null,null,null,"",{"$error":"#VALUE!"},"",{"$error":"#VALUE!"},"",{"$error":"#VALUE!"},"","","",{"$f":"IF(V270>0,COUNTIF(Q$7:Q270,\"=\"&Q270)-1,\"\")","v":""},"",0,0,0,0,0,0,0,0,0,0,0,0,0,0,0,0,0,0,0,0,0,0,0,0,0,0,0,0,0,0,0,0,0,0,0,0,0,0,0,0,0,0,0,0,0,0,0,0,0,0,0,0,0,0,0,0,0,0,0,0,0,0,0,0,0,0,0,0,0,0,0,0,0,0,0,0,0,0,0,null,1,0,0,"","p","p",0]
["",0,0,0,0,null,null,null,null,null,"",{"$error":"#VALUE!"},"",{"$error":"#VALUE!"},"",{"$error":"#VALUE!"},"","","",{"$f":"IF(V271>0,COUNTIF(Q$7:Q271,\"=\"&Q271)-1,\"\")","v":""},"",0,0,0,0,0,0,0,0,0,0,0,0,0,0,0,0,0,0,0,0,0,0,0,0,0,0,0,0,0,0,0,0,0,0,0,0,0,0,0,0,0,0,0,0,0,0,0,0,0,0,0,0,0,0,0,0,0,0,0,0,0,0,0,0,0,0,0,0,0,0,0,0,0,0,0,0,0,0,0,null,1,0,0,"","p","p",0]
["",0,0,0,0,null,null,null,null,null,"",{"$error":"#VALUE!"},"",{"$error":"#VALUE!"},"",{"$error":"#VALUE!"},"","","",{"$f":"IF(V272>0,COUNTIF(Q$7:Q272,\"=\"&Q272)-1,\"\")","v":""},"",0,0,0,0,0,0,0,0,0,0,0,0,0,0,0,0,0,0,0,0,0,0,0,0,0,0,0,0,0,0,0,0,0,0,0,0,0,0,0,0,0,0,0,0,0,0,0,0,0,0,0,0,0,0,0,0,0,0,0,0,0,0,0,0,0,0,0,0,0,0,0,0,0,0,0,0,0,0,0,null,1,0,0,"","p","p",0]
["",0,0,0,0,null,null,null,null,null,"",{"$error":"#VALUE!"},"",{"$error":"#VALUE!"},"",{"$error":"#VALUE!"},"","","",{"$f":"IF(V273>0,COUNTIF(Q$7:Q273,\"=\"&Q273)-1,\"\")","v":""},"",0,0,0,0,0,0,0,0,0,0,0,0,0,0,0,0,0,0,0,0,0,0,0,0,0,0,0,0,0,0,0,0,0,0,0,0,0,0,0,0,0,0,0,0,0,0,0,0,0,0,0,0,0,0,0,0,0,0,0,0,0,0,0,0,0,0,0,0,0,0,0,0,0,0,0,0,0,0,0,null,1,0,0,"","p","p",0]
["",0,0,0,0,null,null,null,null,null,"",{"$error":"#VALUE!"},"",{"$error":"#VALUE!"},"",{"$error":"#VALUE!"},"","","",{"$f":"IF(V274>0,COUNTIF(Q$7:Q274,\"=\"&Q274)-1,\"\")","v":""},"",0,0,0,0,0,0,0,0,0,0,0,0,0,0,0,0,0,0,0,0,0,0,0,0,0,0,0,0,0,0,0,0,0,0,0,0,0,0,0,0,0,0,0,0,0,0,0,0,0,0,0,0,0,0,0,0,0,0,0,0,0,0,0,0,0,0,0,0,0,0,0,0,0,0,0,0,0,0,0,null,1,0,0,"","p","p",0]
["",0,0,0,0,null,null,null,null,null,"",{"$error":"#VALUE!"},"",{"$error":"#VALUE!"},"",{"$error":"#VALUE!"},"","","",{"$f":"IF(V275>0,COUNTIF(Q$7:Q275,\"=\"&Q275)-1,\"\")","v":""},"",0,0,0,0,0,0,0,0,0,0,0,0,0,0,0,0,0,0,0,0,0,0,0,0,0,0,0,0,0,0,0,0,0,0,0,0,0,0,0,0,0,0,0,0,0,0,0,0,0,0,0,0,0,0,0,0,0,0,0,0,0,0,0,0,0,0,0,0,0,0,0,0,0,0,0,0,0,0,0,null,1,0,0,"","p","p",0]
["",0,0,0,0,null,null,null,null,null,"",{"$error":"#VALUE!"},"",{"$error":"#VALUE!"},"",{"$error":"#VALUE!"},"","","",{"$f":"IF(V276>0,COUNTIF(Q$7:Q276,\"=\"&Q276)-1,\"\")","v":""},"",0,0,0,0,0,0,0,0,0,0,0,0,0,0,0,0,0,0,0,0,0,0,0,0,0,0,0,0,0,0,0,0,0,0,0,0,0,0,0,0,0,0,0,0,0,0,0,0,0,0,0,0,0,0,0,0,0,0,0,0,0,0,0,0,0,0,0,0,0,0,0,0,0,0,0,0,0,0,0,null,1,0,0,"","p","p",0]
["",0,0,0,0,null,null,null,null,null,"",{"$error":"#VALUE!"},"",{"$error":"#VALUE!"},"",{"$error":"#VALUE!"},"","","",{"$f":"IF(V277>0,COUNTIF(Q$7:Q277,\"=\"&Q277)-1,\"\")","v":""},"",0,{"$f":"$V277-LEN(SUBSTITUTE($J277,W$4,\"\"))","v":0},0,0,0,0,{"$f":"IF($CZ277>0,$V277-LEN(SUBSTITUTE($J277,AB$4,\"\")),0)","v":0},0,0,0,0,0,0,0,0,0,{"$f":"IF($CZ277>0,$V277-LEN(SUBSTITUTE($J277,AL$4,\"\")),0)","v":0},0,0,0,0,0,0,0,0,0,{"$f":"IF($CZ277>0,$V277-LEN(SUBSTITUTE($J277,AV$4,\"\")),0)","v":0},0,0,0,0,0,0,0,0,0,0,0,0,{"$f":"IF($CZ277>0,$V277-LEN(SUBSTITUTE($J277,BI$4,\"\")),0)","v":0},0,0,0,0,0,0,0,0,0,{"$f":"IF($CZ277>0,$V277-LEN(SUBSTITUTE($J277,BS$4,\"\")),0)","v":0},0,0,0,0,0,0,0,0,0,{"$f":"IF($CZ277>0,$V277-LEN(SUBSTITUTE($J277,CC$4,\"\")),0)","v":0},0,0,0,0,0,0,0,0,0,0,0,0,0,0,0,0,0,0,0,null,1,0,0,"","p","p",0]
["",0,0,0,0,null,null,null,null,null,"",{"$error":"#VALUE!"},"",{"$error":"#VALUE!"},"",{"$error":"#VALUE!"},"","","",{"$f":"IF(V278>0,COUNTIF(Q$7:Q278,\"=\"&Q278)-1,\"\")","v":""},"",0,0,0,0,0,0,0,0,0,0,0,0,0,0,0,0,0,0,0,0,0,0,0,0,0,0,0,0,0,0,0,0,0,0,0,0,0,0,0,0,0,0,0,0,0,0,0,0,0,0,0,0,0,0,0,0,0,0,0,0,0,0,0,0,0,0,0,0,0,0,0,0,0,0,0,0,0,0,0,null,1,0,0,"","p","p",0]
["",0,0,0,0,null,null,null,null,null,"",{"$error":"#VALUE!"},"",{"$error":"#VALUE!"},"",{"$error":"#VALUE!"},"","","",{"$f":"IF(V279>0,COUNTIF(Q$7:Q279,\"=\"&Q279)-1,\"\")","v":""},"",0,0,0,0,0,0,0,0,0,0,0,0,0,0,0,0,0,0,0,0,0,0,0,0,0,0,0,0,0,0,0,0,0,0,0,0,0,0,0,0,0,0,0,0,0,0,0,0,0,0,0,0,0,0,0,0,0,0,0,0,0,0,0,0,0,0,0,0,0,0,0,0,0,0,{"$f":"IF($CZ279>0,$V279-LEN(SUBSTITUTE($J279,CR$4,\"\")),0)","v":0},0,0,0,0,null,1,0,0,"","p","p",0]
["",0,0,0,0,null,null,null,null,null,"",{"$error":"#VALUE!"},"",{"$error":"#VALUE!"},"",{"$error":"#VALUE!"},"","","",{"$f":"IF(V280>0,COUNTIF(Q$7:Q280,\"=\"&Q280)-1,\"\")","v":""},"",0,0,0,0,0,0,0,0,0,0,0,0,0,0,0,0,0,0,0,0,0,0,0,0,0,0,0,0,0,0,0,0,0,0,0,0,0,0,0,0,0,0,0,0,0,0,0,0,0,0,0,0,0,0,0,0,0,0,0,0,0,0,0,0,0,0,0,0,0,0,0,0,0,0,0,0,0,0,0,null,1,0,0,"","p","p",0]
["",0,0,0,0,null,null,null,null,null,"",{"$error":"#VALUE!"},"",{"$error":"#VALUE!"},"",{"$error":"#VALUE!"},"","","",{"$f":"IF(V281>0,COUNTIF(Q$7:Q281,\"=\"&Q281)-1,\"\")","v":""},"",0,0,0,0,0,0,0,0,0,0,0,0,0,0,0,0,0,0,0,0,0,0,0,0,0,0,0,0,0,0,0,0,0,0,0,0,0,0,0,0,0,0,0,0,0,0,0,0,0,0,0,0,0,0,0,0,0,0,0,0,0,0,0,0,0,0,0,0,0,0,0,0,0,0,0,0,0,0,0,null,1,0,0,"","p","p",0]
["",0,0,0,0,null,null,null,null,null,"",{"$error":"#VALUE!"},"",{"$error":"#VALUE!"},"",{"$error":"#VALUE!"},"","","",{"$f":"IF(V282>0,COUNTIF(Q$7:Q282,\"=\"&Q282)-1,\"\")","v":""},"",0,0,0,0,0,0,0,0,0,0,0,0,0,0,0,0,0,0,0,0,0,0,0,0,0,0,0,0,0,0,0,0,0,0,0,0,0,0,0,0,0,0,0,0,0,0,0,0,0,0,0,0,0,0,0,0,0,0,0,0,0,0,0,0,0,0,0,0,0,0,0,0,0,0,0,0,0,0,0,null,1,0,0,"","p","p",0]
["",0,0,0,0,null,null,null,null,null,"",{"$error":"#VALUE!"},"",{"$error":"#VALUE!"},"",{"$error":"#VALUE!"},"","","",{"$f":"IF(V283>0,COUNTIF(Q$7:Q283,\"=\"&Q283)-1,\"\")","v":""},"",0,0,0,0,0,0,0,0,0,0,0,0,0,0,0,0,0,0,0,0,0,0,0,0,0,0,0,0,0,0,0,0,0,0,0,0,0,0,0,0,0,0,0,0,0,0,0,0,0,0,0,0,0,0,0,0,0,0,0,0,0,0,0,0,0,0,0,0,0,0,0,0,0,0,0,0,0,0,0,null,1,0,0,"","p","p",0]
["",0,0,0,0,null,null,null,null,null,"",{"$error":"#VALUE!"},"",{"$error":"#VALUE!"},"",{"$error":"#VALUE!"},"","","",{"$f":"IF(V284>0,COUNTIF(Q$7:Q284,\"=\"&Q284)-1,\"\")","v":""},"",0,0,0,0,0,0,0,0,0,0,0,0,0,0,0,0,0,0,0,0,0,0,0,0,0,0,0,0,0,0,0,0,0,0,0,0,0,0,0,0,0,0,0,0,0,0,0,0,0,0,0,0,0,0,0,0,0,0,0,0,0,0,0,0,0,0,0,0,0,0,0,0,0,0,0,0,0,0,0,null,1,0,0,"","p","p",0]
["",0,0,0,0,null,null,null,null,null,"",{"$error":"#VALUE!"},"",{"$error":"#VALUE!"},"",{"$error":"#VALUE!"},"","","",{"$f":"IF(V285>0,COUNTIF(Q$7:Q285,\"=\"&Q285)-1,\"\")","v":""},"",0,0,0,0,0,0,0,0,0,0,0,0,0,0,0,0,0,0,0,0,0,0,0,0,0,0,0,0,0,0,0,0,0,0,0,0,0,0,0,0,0,0,0,0,0,0,0,0,0,0,0,0,0,0,0,0,0,0,0,0,0,0,0,0,0,0,0,0,0,0,0,0,0,0,0,0,0,0,0,null,1,0,0,"","p","p",0]
["",0,0,0,0,null,null,null,null,null,"",{"$error":"#VALUE!"},"",{"$error":"#VALUE!"},"",{"$error":"#VALUE!"},"","","",{"$f":"IF(V286>0,COUNTIF(Q$7:Q286,\"=\"&Q286)-1,\"\")","v":""},"",0,0,0,0,0,0,0,0,0,0,0,0,0,0,0,0,0,0,0,0,0,0,0,0,0,0,0,0,0,0,0,0,0,0,0,0,0,0,0,0,0,0,0,0,0,0,0,0,0,0,0,0,0,0,0,0,0,0,0,0,0,0,0,0,0,0,0,0,0,0,0,0,0,0,0,0,0,0,0,null,1,0,0,"","p","p",0]
["",0,0,0,0,null,null,null,null,null,"",{"$error":"#VALUE!"},"",{"$error":"#VALUE!"},"",{"$error":"#VALUE!"},"","","",{"$f":"IF(V287>0,COUNTIF(Q$7:Q287,\"=\"&Q287)-1,\"\")","v":""},"",0,{"$f":"$V287-LEN(SUBSTITUTE($J287,W$4,\"\"))","v":0},0,0,0,0,{"$f":"IF($CZ287>0,$V287-LEN(SUBSTITUTE($J287,AB$4,\"\")),0)","v":0},0,0,0,0,0,0,0,0,0,{"$f":"IF($CZ287>0,$V287-LEN(SUBSTITUTE($J287,AL$4,\"\")),0)","v":0},0,0,0,0,0,0,0,0,0,{"$f":"IF($CZ287>0,$V287-LEN(SUBSTITUTE($J287,AV$4,\"\")),0)","v":0},0,0,0,0,0,0,0,0,0,0,0,0,{"$f":"IF($CZ287>0,$V287-LEN(SUBSTITUTE($J287,BI$4,\"\")),0)","v":0},0,0,0,0,0,0,0,0,0,{"$f":"IF($CZ287>0,$V287-LEN(SUBSTITUTE($J287,BS$4,\"\")),0)","v":0},0,0,0,0,0,0,0,0,0,{"$f":"IF($CZ287>0,$V287-LEN(SUBSTITUTE($J287,CC$4,\"\")),0)","v":0},0,0,0,0,0,0,0,0,0,0,{"$f":"IF($CZ287>0,$V287-LEN(SUBSTITUTE($J287,CN$4,\"\")),0)","v":0},0,0,0,0,0,0,0,0,null,1,0,0,"","p","p",0]
["",0,0,0,0,null,null,null,null,null,"",{"$error":"#VALUE!"},"",{"$error":"#VALUE!"},"",{"$error":"#VALUE!"},"","","",{"$f":"IF(V288>0,COUNTIF(Q$7:Q288,\"=\"&Q288)-1,\"\")","v":""},"",0,0,0,0,0,0,0,0,0,0,0,0,0,0,0,0,0,0,0,0,0,0,0,0,0,0,0,0,0,0,0,0,0,0,0,0,0,0,0,0,0,0,0,0,0,0,0,0,0,0,0,0,0,0,0,0,0,0,0,0,0,0,0,0,0,0,0,0,0,0,0,0,0,0,0,0,0,0,0,null,1,0,0,"","p","p",0]
["",0,0,0,0,null,null,null,null,null,"",{"$error":"#VALUE!"},"",{"$error":"#VALUE!"},"",{"$error":"#VALUE!"},"","","",{"$f":"IF(V289>0,COUNTIF(Q$7:Q289,\"=\"&Q289)-1,\"\")","v":""},"",0,0,0,0,0,0,0,0,0,0,0,0,0,0,0,0,0,0,0,0,0,0,0,0,0,0,0,0,0,0,0,0,0,0,0,0,0,0,0,0,0,0,0,0,0,0,0,0,0,0,0,0,0,0,0,0,0,0,0,0,0,0,0,0,0,0,0,0,0,0,0,0,0,0,0,0,0,0,0,null,1,0,0,"","p","p",0]
["",0,0,0,0,null,null,null,null,null,"",{"$error":"#VALUE!"},"",{"$error":"#VALUE!"},"",{"$error":"#VALUE!"},"","","",{"$f":"IF(V290>0,COUNTIF(Q$7:Q290,\"=\"&Q290)-1,\"\")","v":""},"",0,0,0,0,0,0,0,0,0,0,0,0,0,0,0,0,0,0,0,0,0,0,0,0,0,0,0,0,0,0,0,0,0,0,0,0,0,0,0,0,0,0,0,0,0,0,0,0,0,0,0,0,0,0,0,0,0,0,0,0,0,0,0,0,0,0,0,0,0,0,0,0,0,0,0,0,0,0,0,null,1,0,0,"","p","p",0]
["",0,0,0,0,null,null,null,null,null,"",{"$error":"#VALUE!"},"",{"$error":"#VALUE!"},"",{"$error":"#VALUE!"},"","","",{"$f":"IF(V291>0,COUNTIF(Q$7:Q291,\"=\"&Q291)-1,\"\")","v":""},"",0,0,0,0,0,0,0,0,0,0,0,0,0,0,0,0,0,0,0,0,0,0,0,0,0,0,0,0,0,0,0,0,0,0,0,0,0,0,0,0,0,0,0,0,0,0,0,0,0,0,0,0,0,0,0,0,0,0,0,0,0,0,0,0,0,0,0,0,0,0,0,0,0,0,0,0,0,0,0,null,1,0,0,"","p","p",0]
["",0,0,0,0,null,null,null,null,null,"",{"$error":"#VALUE!"},"",{"$error":"#VALUE!"},"",{"$error":"#VALUE!"},"","","",{"$f":"IF(V292>0,COUNTIF(Q$7:Q292,\"=\"&Q292)-1,\"\")","v":""},"",0,0,0,0,0,0,0,0,0,0,0,0,0,0,0,0,0,0,0,0,0,0,0,0,0,0,0,0,0,0,0,0,0,0,0,0,0,0,0,0,0,0,0,0,0,0,0,0,0,0,0,0,0,0,0,0,0,0,0,0,0,0,0,0,0,0,0,0,0,0,0,0,0,0,0,0,0,0,0,null,1,0,0,"","p","p",0]
["",0,0,0,0,null,null,null,null,null,"",{"$error":"#VALUE!"},"",{"$error":"#VALUE!"},"",{"$error":"#VALUE!"},"","","",{"$f":"IF(V293>0,COUNTIF(Q$7:Q293,\"=\"&Q293)-1,\"\")","v":""},"",0,0,0,0,0,0,0,0,0,0,0,0,0,0,0,0,0,0,0,0,0,0,0,0,0,0,0,0,0,0,0,0,0,0,0,0,0,0,0,0,0,0,0,0,0,0,0,0,0,0,0,0,0,0,0,0,0,0,0,0,0,0,0,0,0,0,0,0,0,0,0,0,0,0,0,0,0,0,0,null,1,0,0,"","p","p",0]
["",0,0,0,0,null,null,null,null,null,"",{"$error":"#VALUE!"},"",{"$error":"#VALUE!"},"",{"$error":"#VALUE!"},"","","",{"$f":"IF(V294>0,COUNTIF(Q$7:Q294,\"=\"&Q294)-1,\"\")","v":""},"",0,0,0,0,0,0,0,0,0,0,0,0,0,0,0,0,0,0,0,0,0,0,0,0,0,0,0,0,0,0,0,0,0,0,0,0,0,0,0,0,0,0,0,0,0,0,0,0,0,0,0,0,0,0,0,0,0,0,0,0,0,0,0,0,0,0,0,0,0,0,0,0,0,0,0,0,0,0,0,null,1,0,0,"","p","p",0]
["",0,0,0,0,null,null,null,null,null,"",{"$error":"#VALUE!"},"",{"$error":"#VALUE!"},"",{"$error":"#VALUE!"},"","","",{"$f":"IF(V295>0,COUNTIF(Q$7:Q295,\"=\"&Q295)-1,\"\")","v":""},"",0,0,0,0,0,0,0,0,0,0,0,0,0,0,0,0,0,0,0,0,0,0,0,0,0,0,0,0,0,0,0,0,0,0,0,0,0,0,0,0,0,0,0,0,0,0,0,0,0,0,0,0,0,0,0,0,0,0,0,0,0,0,0,0,0,0,0,0,0,0,0,0,0,0,{"$f":"IF($CZ295>0,$V295-LEN(SUBSTITUTE($J295,CR$4,\"\")),0)","v":0},0,0,0,0,null,1,0,0,"","p","p",0]
["",0,0,0,0,null,null,null,null,null,"",{"$error":"#VALUE!"},"",{"$error":"#VALUE!"},"",{"$error":"#VALUE!"},"","","",{"$f":"IF(V296>0,COUNTIF(Q$7:Q296,\"=\"&Q296)-1,\"\")","v":""},"",0,0,0,0,0,0,0,0,0,0,0,0,0,0,0,0,0,0,0,0,0,0,0,0,0,0,0,0,0,0,0,0,0,0,0,0,0,0,0,0,0,0,0,0,0,0,0,0,0,0,0,0,0,0,0,0,0,0,0,0,0,0,0,0,0,0,0,0,0,0,0,0,0,0,0,0,0,0,0,null,1,0,0,"","p","p",0]
["",0,0,0,0,null,null,null,null,null,"",{"$error":"#VALUE!"},"",{"$error":"#VALUE!"},"",{"$error":"#VALUE!"},"","","",{"$f":"IF(V297>0,COUNTIF(Q$7:Q297,\"=\"&Q297)-1,\"\")","v":""},"",0,{"$f":"$V297-LEN(SUBSTITUTE($J297,W$4,\"\"))","v":0},0,0,0,0,{"$f":"IF($CZ297>0,$V297-LEN(SUBSTITUTE($J297,AB$4,\"\")),0)","v":0},0,0,0,0,0,0,0,0,0,{"$f":"IF($CZ297>0,$V297-LEN(SUBSTITUTE($J297,AL$4,\"\")),0)","v":0},0,0,0,0,0,0,0,0,0,{"$f":"IF($CZ297>0,$V297-LEN(SUBSTITUTE($J297,AV$4,\"\")),0)","v":0},0,0,0,0,0,0,0,0,0,0,0,0,{"$f":"IF($CZ297>0,$V297-LEN(SUBSTITUTE($J297,BI$4,\"\")),0)","v":0},0,0,0,0,0,0,0,0,0,{"$f":"IF($CZ297>0,$V297-LEN(SUBSTITUTE($J297,BS$4,\"\")),0)","v":0},0,0,0,0,0,0,0,0,0,{"$f":"IF($CZ297>0,$V297-LEN(SUBSTITUTE($J297,CC$4,\"\")),0)","v":0},0,0,0,0,0,0,0,0,0,0,0,0,0,0,0,0,0,0,0,null,1,0,0,"","p","p",0]
["",0,0,0,0,null,null,null,null,null,"",{"$error":"#VALUE!"},"",{"$error":"#VALUE!"},"",{"$error":"#VALUE!"},"","","",{"$f":"IF(V298>0,COUNTIF(Q$7:Q298,\"=\"&Q298)-1,\"\")","v":""},"",0,0,0,0,0,0,0,0,0,0,0,0,0,0,0,0,0,0,0,0,0,0,0,0,0,0,0,0,0,0,0,0,0,0,0,0,0,0,0,0,0,0,0,0,0,0,0,0,0,0,0,0,0,0,0,0,0,0,0,0,0,0,0,0,0,0,0,0,0,0,0,0,0,0,0,0,0,0,0,null,1,0,0,"","p","p",0]
["",0,0,0,0,null,null,null,null,null,"",{"$error":"#VALUE!"},"",{"$error":"#VALUE!"},"",{"$error":"#VALUE!"},"","","",{"$f":"IF(V299>0,COUNTIF(Q$7:Q299,\"=\"&Q299)-1,\"\")","v":""},"",0,0,0,0,0,0,0,0,0,0,0,0,0,0,0,0,0,0,0,0,0,0,0,0,0,0,0,0,0,0,0,0,0,0,0,0,0,0,0,0,0,0,0,0,0,0,0,0,0,0,0,0,0,0,0,0,0,0,0,0,0,0,0,0,0,0,0,0,0,0,0,0,0,0,0,0,0,0,0,null,1,0,0,"","p","p",0]
["",0,0,0,0,null,null,null,null,null,"",{"$error":"#VALUE!"},"",{"$error":"#VALUE!"},"",{"$error":"#VALUE!"},"","","",{"$f":"IF(V300>0,COUNTIF(Q$7:Q300,\"=\"&Q300)-1,\"\")","v":""},"",0,0,0,0,0,0,0,0,0,0,0,0,0,0,0,0,0,0,0,0,0,0,0,0,0,0,0,0,0,0,0,0,0,0,0,0,0,0,0,0,0,0,0,0,0,0,0,0,0,0,0,0,0,0,0,0,0,0,0,0,0,0,0,0,0,0,0,0,0,0,0,0,0,0,0,0,0,0,0,null,1,0,0,"","p","p",0]
["",0,0,0,0,null,null,null,null,null,"",{"$error":"#VALUE!"},"",{"$error":"#VALUE!"},"",{"$error":"#VALUE!"},"","","",{"$f":"IF(V301>0,COUNTIF(Q$7:Q301,\"=\"&Q301)-1,\"\")","v":""},"",0,0,0,0,0,0,0,0,0,0,0,0,0,0,0,0,0,0,0,0,0,0,0,0,0,0,0,0,0,0,0,0,0,0,0,0,0,0,0,0,0,0,0,0,0,0,0,0,0,0,0,0,0,0,0,0,0,0,0,0,0,0,0,0,0,0,0,0,0,0,0,0,0,0,0,0,0,0,0,null,1,0,0,"","p","p",0]
["",0,0,0,0,null,null,null,null,null,"",{"$error":"#VALUE!"},"",{"$error":"#VALUE!"},"",{"$error":"#VALUE!"},"","","",{"$f":"IF(V302>0,COUNTIF(Q$7:Q302,\"=\"&Q302)-1,\"\")","v":""},"",0,0,0,0,0,0,0,0,0,0,0,0,0,0,0,0,0,0,0,0,0,0,0,0,0,0,0,0,0,0,0,0,0,0,0,0,0,0,0,0,0,0,0,0,0,0,0,0,0,0,0,0,0,0,0,0,0,0,0,0,0,0,0,0,0,0,0,0,0,0,0,0,0,0,0,0,0,0,0,null,1,0,0,"","p","p",0]
["",0,0,0,0,null,null,null,null,null,"",{"$error":"#VALUE!"},"",{"$error":"#VALUE!"},"",{"$error":"#VALUE!"},"","","",{"$f":"IF(V303>0,COUNTIF(Q$7:Q303,\"=\"&Q303)-1,\"\")","v":""},"",0,0,0,0,0,0,0,0,0,0,0,0,0,0,0,0,0,0,0,0,0,0,0,0,0,0,0,0,0,0,0,0,0,0,0,0,0,0,0,0,0,0,0,0,0,0,0,0,0,0,0,0,0,0,0,0,0,0,0,0,0,0,0,0,0,0,0,0,0,0,0,0,0,0,0,0,0,0,0,null,1,0,0,"","p","p",0]
["",0,0,0,0,null,null,null,null,null,"",{"$error":"#VALUE!"},"",{"$error":"#VALUE!"},"",{"$error":"#VALUE!"},"","","",{"$f":"IF(V304>0,COUNTIF(Q$7:Q304,\"=\"&Q304)-1,\"\")","v":""},"",0,0,0,0,0,0,0,0,0,0,0,0,0,0,0,0,0,0,0,0,0,0,0,0,0,0,0,0,0,0,0,0,0,0,0,0,0,0,0,0,0,0,0,0,0,0,0,0,0,0,0,0,0,0,0,0,0,0,0,0,0,0,0,0,0,0,0,0,0,0,0,0,0,0,0,0,0,0,0,null,1,0,0,"","p","p",0]
["",0,0,0,0,null,null,null,null,null,"",{"$error":"#VALUE!"},"",{"$error":"#VALUE!"},"",{"$error":"#VALUE!"},"","","",{"$f":"IF(V305>0,COUNTIF(Q$7:Q305,\"=\"&Q305)-1,\"\")","v":""},"",0,0,0,0,0,0,0,0,0,0,0,0,0,0,0,0,0,0,0,0,0,0,0,0,0,0,0,0,0,0,0,0,0,0,0,0,0,0,0,0,0,0,0,0,0,0,0,0,0,0,0,0,0,0,0,0,0,0,0,0,0,0,0,0,0,0,0,0,0,0,0,0,0,0,0,0,0,0,0,null,1,0,0,"","p","p",0]
["",0,0,0,0,null,null,null,null,null,"",{"$error":"#VALUE!"},"",{"$error":"#VALUE!"},"",{"$error":"#VALUE!"},"","","",{"$f":"IF(V306>0,COUNTIF(Q$7:Q306,\"=\"&Q306)-1,\"\")","v":""},"",0,0,0,0,0,0,0,0,0,0,0,0,0,0,0,0,0,0,0,0,0,0,0,0,0,0,0,0,0,0,0,0,0,0,0,0,0,0,0,0,0,0,0,0,0,0,0,0,0,0,0,0,0,0,0,0,0,0,0,0,0,0,0,0,0,0,0,0,0,0,0,0,0,0,0,0,0,0,0,null,1,0,0,"","p","p",0]
["",0,0,0,0,null,null,null,null,null,"",{"$error":"#VALUE!"},"",{"$error":"#VALUE!"},"",{"$error":"#VALUE!"},"","","",{"$f":"IF(V307>0,COUNTIF(Q$7:Q307,\"=\"&Q307)-1,\"\")","v":""},"",0,{"$f":"$V307-LEN(SUBSTITUTE($J307,W$4,\"\"))","v":0},0,0,0,0,{"$f":"IF($CZ307>0,$V307-LEN(SUBSTITUTE($J307,AB$4,\"\")),0)","v":0},0,0,0,0,0,0,0,0,0,{"$f":"IF($CZ307>0,$V307-LEN(SUBSTITUTE($J307,AL$4,\"\")),0)","v":0},0,0,0,0,0,0,0,0,0,{"$f":"IF($CZ307>0,$V307-LEN(SUBSTITUTE($J307,AV$4,\"\")),0)","v":0},0,0,0,0,0,0,0,0,0,0,0,0,{"$f":"IF($CZ307>0,$V307-LEN(SUBSTITUTE($J307,BI$4,\"\")),0)","v":0},0,0,0,0,0,0,0,0,0,{"$f":"IF($CZ307>0,$V307-LEN(SUBSTITUTE($J307,BS$4,\"\")),0)","v":0},0,0,0,0,0,0,0,0,0,{"$f":"IF($CZ307>0,$V307-LEN(SUBSTITUTE($J307,CC$4,\"\")),0)","v":0},0,0,0,0,0,0,0,0,0,0,{"$f":"IF($CZ307>0,$V307-LEN(SUBSTITUTE($J307,CN$4,\"\")),0)","v":0},0,0,0,0,0,0,0,0,null,1,0,0,"","p","p",0]
["",0,0,0,0,null,null,null,null,null,"",{"$error":"#VALUE!"},"",{"$error":"#VALUE!"},"",{"$error":"#VALUE!"},"","","",{"$f":"IF(V308>0,COUNTIF(Q$7:Q308,\"=\"&Q308)-1,\"\")","v":""},"",0,0,0,0,0,0,0,0,0,0,0,0,0,0,0,0,0,0,0,0,0,0,0,0,0,0,0,0,0,0,0,0,0,0,0,0,0,0,0,0,0,0,0,0,0,0,0,0,0,0,0,0,0,0,0,0,0,0,0,0,0,0,0,0,0,0,0,0,0,0,0,0,0,0,0,0,0,0,0,null,1,0,0,"","p","p",0]
["",0,0,0,0,null,null,null,null,null,"",{"$error":"#VALUE!"},"",{"$error":"#VALUE!"},"",{"$error":"#VALUE!"},"","","",{"$f":"IF(V309>0,COUNTIF(Q$7:Q309,\"=\"&Q309)-1,\"\")","v":""},"",0,0,0,0,0,0,0,0,0,0,0,0,0,0,0,0,0,0,0,0,0,0,0,0,0,0,0,0,0,0,0,0,0,0,0,0,0,0,0,0,0,0,0,0,0,0,0,0,0,0,0,0,0,0,0,0,0,0,0,0,0,0,0,0,0,0,0,0,0,0,0,0,0,0,0,0,0,0,0,null,1,0,0,"","p","p",0]
["",0,0,0,0,null,null,null,null,null,"",{"$error":"#VALUE!"},"",{"$error":"#VALUE!"},"",{"$error":"#VALUE!"},"","","",{"$f":"IF(V310>0,COUNTIF(Q$7:Q310,\"=\"&Q310)-1,\"\")","v":""},"",0,0,0,0,0,0,0,0,0,0,0,0,0,0,0,0,0,0,0,0,0,0,0,0,0,0,0,0,0,0,0,0,0,0,0,0,0,0,0,0,0,0,0,0,0,0,0,0,0,0,0,0,0,0,0,0,0,0,0,0,0,0,0,0,0,0,0,0,0,0,0,0,0,0,0,0,0,0,0,null,1,0,0,"","p","p",0]
["",0,0,0,0,null,null,null,null,null,"",{"$error":"#VALUE!"},"",{"$error":"#VALUE!"},"",{"$error":"#VALUE!"},"","","",{"$f":"IF(V311>0,COUNTIF(Q$7:Q311,\"=\"&Q311)-1,\"\")","v":""},"",0,0,0,0,0,0,0,0,0,0,0,0,0,0,0,0,0,0,0,0,0,0,0,0,0,0,0,0,0,0,0,0,0,0,0,0,0,0,0,0,0,0,0,0,0,0,0,0,0,0,0,0,0,0,0,0,0,0,0,0,0,0,0,0,0,0,0,0,0,0,0,0,0,0,{"$f":"IF($CZ311>0,$V311-LEN(SUBSTITUTE($J311,CR$4,\"\")),0)","v":0},0,0,0,0,null,1,0,0,"","p","p",0]
["",0,0,0,0,null,null,null,null,null,"",{"$error":"#VALUE!"},"",{"$error":"#VALUE!"},"",{"$error":"#VALUE!"},"","","",{"$f":"IF(V312>0,COUNTIF(Q$7:Q312,\"=\"&Q312)-1,\"\")","v":""},"",0,0,0,0,0,0,0,0,0,0,0,0,0,0,0,0,0,0,0,0,0,0,0,0,0,0,0,0,0,0,0,0,0,0,0,0,0,0,0,0,0,0,0,0,0,0,0,0,0,0,0,0,0,0,0,0,0,0,0,0,0,0,0,0,0,0,0,0,0,0,0,0,0,0,0,0,0,0,0,null,1,0,0,"","p","p",0]
["",0,0,0,0,null,null,null,null,null,"",{"$error":"#VALUE!"},"",{"$error":"#VALUE!"},"",{"$error":"#VALUE!"},"","","",{"$f":"IF(V313>0,COUNTIF(Q$7:Q313,\"=\"&Q313)-1,\"\")","v":""},"",0,0,0,0,0,0,0,0,0,0,0,0,0,0,0,0,0,0,0,0,0,0,0,0,0,0,0,0,0,0,0,0,0,0,0,0,0,0,0,0,0,0,0,0,0,0,0,0,0,0,0,0,0,0,0,0,0,0,0,0,0,0,0,0,0,0,0,0,0,0,0,0,0,0,0,0,0,0,0,null,1,0,0,"","p","p",0]
["",0,0,0,0,null,null,null,null,null,"",{"$error":"#VALUE!"},"",{"$error":"#VALUE!"},"",{"$error":"#VALUE!"},"","","",{"$f":"IF(V314>0,COUNTIF(Q$7:Q314,\"=\"&Q314)-1,\"\")","v":""},"",0,0,0,0,0,0,0,0,0,0,0,0,0,0,0,0,0,0,0,0,0,0,0,0,0,0,0,0,0,0,0,0,0,0,0,0,0,0,0,0,0,0,0,0,0,0,0,0,0,0,0,0,0,0,0,0,0,0,0,0,0,0,0,0,0,0,0,0,0,0,0,0,0,0,0,0,0,0,0,null,1,0,0,"","p","p",0]
["",0,0,0,0,null,null,null,null,null,"",{"$error":"#VALUE!"},"",{"$error":"#VALUE!"},"",{"$error":"#VALUE!"},"","","",{"$f":"IF(V315>0,COUNTIF(Q$7:Q315,\"=\"&Q315)-1,\"\")","v":""},"",0,0,0,0,0,0,0,0,0,0,0,0,0,0,0,0,0,0,0,0,0,0,0,0,0,0,0,0,0,0,0,0,0,0,0,0,0,0,0,0,0,0,0,0,0,0,0,0,0,0,0,0,0,0,0,0,0,0,0,0,0,0,0,0,0,0,0,0,0,0,0,0,0,0,0,0,0,0,0,null,1,0,0,"","p","p",0]
["",0,0,0,0,null,null,null,null,null,"",{"$error":"#VALUE!"},"",{"$error":"#VALUE!"},"",{"$error":"#VALUE!"},"","","",{"$f":"IF(V316>0,COUNTIF(Q$7:Q316,\"=\"&Q316)-1,\"\")","v":""},"",0,0,0,0,0,0,0,0,0,0,0,0,0,0,0,0,0,0,0,0,0,0,0,0,0,0,0,0,0,0,0,0,0,0,0,0,0,0,0,0,0,0,0,0,0,0,0,0,0,0,0,0,0,0,0,0,0,0,0,0,0,0,0,0,0,0,0,0,0,0,0,0,0,0,0,0,0,0,0,null,1,0,0,"","p","p",0]
["",0,0,0,0,null,null,null,null,null,"",{"$error":"#VALUE!"},"",{"$error":"#VALUE!"},"",{"$error":"#VALUE!"},"","","",{"$f":"IF(V317>0,COUNTIF(Q$7:Q317,\"=\"&Q317)-1,\"\")","v":""},"",0,{"$f":"$V317-LEN(SUBSTITUTE($J317,W$4,\"\"))","v":0},0,0,0,0,{"$f":"IF($CZ317>0,$V317-LEN(SUBSTITUTE($J317,AB$4,\"\")),0)","v":0},0,0,0,0,0,0,0,0,0,{"$f":"IF($CZ317>0,$V317-LEN(SUBSTITUTE($J317,AL$4,\"\")),0)","v":0},0,0,0,0,0,0,0,0,0,{"$f":"IF($CZ317>0,$V317-LEN(SUBSTITUTE($J317,AV$4,\"\")),0)","v":0},0,0,0,0,0,0,0,0,0,0,0,0,{"$f":"IF($CZ317>0,$V317-LEN(SUBSTITUTE($J317,BI$4,\"\")),0)","v":0},0,0,0,0,0,0,0,0,0,{"$f":"IF($CZ317>0,$V317-LEN(SUBSTITUTE($J317,BS$4,\"\")),0)","v":0},0,0,0,0,0,0,0,0,0,{"$f":"IF($CZ317>0,$V317-LEN(SUBSTITUTE($J317,CC$4,\"\")),0)","v":0},0,0,0,0,0,0,0,0,0,0,0,0,0,0,0,0,0,0,0,null,1,0,0,"","p","p",0]
["",0,0,0,0,null,null,null,null,null,"",{"$error":"#VALUE!"},"",{"$error":"#VALUE!"},"",{"$error":"#VALUE!"},"","","",{"$f":"IF(V318>0,COUNTIF(Q$7:Q318,\"=\"&Q318)-1,\"\")","v":""},"",0,0,0,0,0,0,0,0,0,0,0,0,0,0,0,0,0,0,0,0,0,0,0,0,0,0,0,0,0,0,0,0,0,0,0,0,0,0,0,0,0,0,0,0,0,0,0,0,0,0,0,0,0,0,0,0,0,0,0,0,0,0,0,0,0,0,0,0,0,0,0,0,0,0,0,0,0,0,0,null,1,0,0,"","p","p",0]
["",0,0,0,0,null,null,null,null,null,"",{"$error":"#VALUE!"},"",{"$error":"#VALUE!"},"",{"$error":"#VALUE!"},"","","",{"$f":"IF(V319>0,COUNTIF(Q$7:Q319,\"=\"&Q319)-1,\"\")","v":""},"",0,0,0,0,0,0,0,0,0,0,0,0,0,0,0,0,0,0,0,0,0,0,0,0,0,0,0,0,0,0,0,0,0,0,0,0,0,0,0,0,0,0,0,0,0,0,0,0,0,0,0,0,0,0,0,0,0,0,0,0,0,0,0,0,0,0,0,0,0,0,0,0,0,0,0,0,0,0,0,null,1,0,0,"","p","p",0]
["",0,0,0,0,null,null,null,null,null,"",{"$error":"#VALUE!"},"",{"$error":"#VALUE!"},"",{"$error":"#VALUE!"},"","","",{"$f":"IF(V320>0,COUNTIF(Q$7:Q320,\"=\"&Q320)-1,\"\")","v":""},"",0,0,0,0,0,0,0,0,0,0,0,0,0,0,0,0,0,0,0,0,0,0,0,0,0,0,0,0,0,0,0,0,0,0,0,0,0,0,0,0,0,0,0,0,0,0,0,0,0,0,0,0,0,0,0,0,0,0,0,0,0,0,0,0,0,0,0,0,0,0,0,0,0,0,0,0,0,0,0,null,1,0,0,"","p","p",0]
["",0,0,0,0,null,null,null,null,null,"",{"$error":"#VALUE!"},"",{"$error":"#VALUE!"},"",{"$error":"#VALUE!"},"","","",{"$f":"IF(V321>0,COUNTIF(Q$7:Q321,\"=\"&Q321)-1,\"\")","v":""},"",0,0,0,0,0,0,0,0,0,0,0,0,0,0,0,0,0,0,0,0,0,0,0,0,0,0,0,0,0,0,0,0,0,0,0,0,0,0,0,0,0,0,0,0,0,0,0,0,0,0,0,0,0,0,0,0,0,0,0,0,0,0,0,0,0,0,0,0,0,0,0,0,0,0,0,0,0,0,0,null,1,0,0,"","p","p",0]
["",0,0,0,0,null,null,null,null,null,"",{"$error":"#VALUE!"},"",{"$error":"#VALUE!"},"",{"$error":"#VALUE!"},"","","",{"$f":"IF(V322>0,COUNTIF(Q$7:Q322,\"=\"&Q322)-1,\"\")","v":""},"",0,0,0,0,0,0,0,0,0,0,0,0,0,0,0,0,0,0,0,0,0,0,0,0,0,0,0,0,0,0,0,0,0,0,0,0,0,0,0,0,0,0,0,0,0,0,0,0,0,0,0,0,0,0,0,0,0,0,0,0,0,0,0,0,0,0,0,0,0,0,0,0,0,0,0,0,0,0,0,null,1,0,0,"","p","p",0]
["",0,0,0,0,null,null,null,null,null,"",{"$error":"#VALUE!"},"",{"$error":"#VALUE!"},"",{"$error":"#VALUE!"},"","","",{"$f":"IF(V323>0,COUNTIF(Q$7:Q323,\"=\"&Q323)-1,\"\")","v":""},"",0,0,0,0,0,0,0,0,0,0,0,0,0,0,0,0,0,0,0,0,0,0,0,0,0,0,0,0,0,0,0,0,0,0,0,0,0,0,0,0,0,0,0,0,0,0,0,0,0,0,0,0,0,0,0,0,0,0,0,0,0,0,0,0,0,0,0,0,0,0,0,0,0,0,0,0,0,0,0,null,1,0,0,"","p","p",0]
["",0,0,0,0,null,null,null,null,null,"",{"$error":"#VALUE!"},"",{"$error":"#VALUE!"},"",{"$error":"#VALUE!"},"","","",{"$f":"IF(V324>0,COUNTIF(Q$7:Q324,\"=\"&Q324)-1,\"\")","v":""},"",0,0,0,0,0,0,0,0,0,0,0,0,0,0,0,0,0,0,0,0,0,0,0,0,0,0,0,0,0,0,0,0,0,0,0,0,0,0,0,0,0,0,0,0,0,0,0,0,0,0,0,0,0,0,0,0,0,0,0,0,0,0,0,0,0,0,0,0,0,0,0,0,0,0,0,0,0,0,0,null,1,0,0,"","p","p",0]
["",0,0,0,0,null,null,null,null,null,"",{"$error":"#VALUE!"},"",{"$error":"#VALUE!"},"",{"$error":"#VALUE!"},"","","",{"$f":"IF(V325>0,COUNTIF(Q$7:Q325,\"=\"&Q325)-1,\"\")","v":""},"",0,0,0,0,0,0,0,0,0,0,0,0,0,0,0,0,0,0,0,0,0,0,0,0,0,0,0,0,0,0,0,0,0,0,0,0,0,0,0,0,0,0,0,0,0,0,0,0,0,0,0,0,0,0,0,0,0,0,0,0,0,0,0,0,0,0,0,0,0,0,0,0,0,0,0,0,0,0,0,null,1,0,0,"","p","p",0]
["",0,0,0,0,null,null,null,null,null,"",{"$error":"#VALUE!"},"",{"$error":"#VALUE!"},"",{"$error":"#VALUE!"},"","","",{"$f":"IF(V326>0,COUNTIF(Q$7:Q326,\"=\"&Q326)-1,\"\")","v":""},"",0,0,0,0,0,0,0,0,0,0,0,0,0,0,0,0,0,0,0,0,0,0,0,0,0,0,0,0,0,0,0,0,0,0,0,0,0,0,0,0,0,0,0,0,0,0,0,0,0,0,0,0,0,0,0,0,0,0,0,0,0,0,0,0,0,0,0,0,0,0,0,0,0,0,0,0,0,0,0,null,1,0,0,"","p","p",0]
[{"$f":"IF(V327=0,\"\",A326+1)","v":""},0,{"$f":"IF($C$2=\"forced-OH\",-1,IF($G327=1,$C$3,IF($G327=2,$D$3,0)))","v":0},{"$f":"IF($F327=1,VLOOKUP($B$2,$DE$5:$DI$11,5,FALSE),0)","v":0},{"$f":"IF($F327=1,VLOOKUP($B$2,$DE$5:$DG$11,3,FALSE),0)","v":0},null,null,null,null,null,{"$f":"IF(V327=0,\"\",SUMPRODUCT(W$5:CY$5,W327:CY327))","v":""},{"$f":"IF(C327=-1,\"\",K327-18.01528)","v":{"$error":"#VALUE!"}},{"$f":"IF(V327=0,\"\",SUMPRODUCT(W$6:CY$6,W327:CY327))","v":""},{"$f":"IF(C327=-1,\"\",M327-18.0105646861)","v":{"$error":"#VALUE!"}},{"$f":"IF(V327=0,\"\",M327+TRUNC(K327-M327-0.1))","v":""},{"$f":"IF(C327=-1,\"\",O327-18.0105646861)","v":{"$error":"#VALUE!"}},{"$f":"IF(V327>0,ROUND(K327,4),\"\")","v":""},{"$f":"IF(V327>0,S327+T327,\"\")","v":""},{"$f":"IF(V327>0,COUNTIF(Q$7:Q$651,\"<\"&Q327)+1,\"\")","v":""},{"$f":"IF(V327>0,COUNTIF(Q$7:Q327,\"=\"&Q327)-1,\"\")","v":""},{"$f":"IF(V327>0,$R$6-R327+1,\"\")","v":""},{"$f":"LEN(J327)","v":0},{"$f":"$V327-LEN(SUBSTITUTE($J327,W$4,\"\"))","v":0},0,0,0,0,{"$f":"IF($CZ327>0,$V327-LEN(SUBSTITUTE($J327,AB$4,\"\")),0)","v":0},0,0,0,0,0,0,0,0,0,{"$f":"IF($CZ327>0,$V327-LEN(SUBSTITUTE($J327,AL$4,\"\")),0)","v":0},0,0,0,0,0,0,0,0,0,{"$f":"IF($CZ327>0,$V327-LEN(SUBSTITUTE($J327,AV$4,\"\")),0)","v":0},0,0,0,0,0,0,0,0,0,0,0,{"$f":"IF($CZ327>0,$V327-LEN(SUBSTITUTE($J327,BH$4,\"\")),0)+DD327","v":0},{"$f":"IF($CZ327>0,$V327-LEN(SUBSTITUTE($J327,BI$4,\"\")),0)","v":0},0,0,0,0,0,0,0,0,0,{"$f":"IF($CZ327>0,$V327-LEN(SUBSTITUTE($J327,BS$4,\"\")),0)","v":0},0,0,0,0,0,0,0,0,0,{"$f":"IF($CZ327>0,$V327-LEN(SUBSTITUTE($J327,CC$4,\"\")),0)","v":0},0,0,0,0,0,0,0,0,0,0,{"$f":"IF($CZ327>0,$V327-LEN(SUBSTITUTE($J327,CN$4,\"\")),0)","v":0},0,0,0,{"$f":"IF($CZ327>0,$V327-LEN(SUBSTITUTE($J327,CR$4,\"\")),0)","v":0},0,0,0,{"$f":"V327+B327+C327","v":0},null,{"$f":"-(V327-1)+D327","v":1},{"$f":"E327","v":0},{"$f":"$V327-$W327-$X327-$Z327-$AA327","v":0},"",{"$f":"IF($C327=0,\"p\",\"\")","v":"p"},{"$f":"DA327&J327&DB327","v":"p"},{"$f":"IF($F327=1,VLOOKUP($B$2,$DE$5:$DH$11,4,FALSE),0)","v":0}]
["",{"$f":"IF($F328=1,VLOOKUP($B$2,$DE$5:$DG$11,2,FALSE),IF($F328=2,VLOOKUP($B$3,$DE$5:$DG$6,2,FALSE),0))","v":0},0,0,0,null,null,null,null,null,"",{"$error":"#VALUE!"},"",{"$error":"#VALUE!"},"",{"$error":"#VALUE!"},"","","",{"$f":"IF(V328>0,COUNTIF(Q$7:Q328,\"=\"&Q328)-1,\"\")","v":""},"",0,0,0,0,0,0,0,0,0,0,0,0,0,0,0,0,0,0,0,0,0,0,0,0,0,0,0,0,0,0,0,0,0,0,0,0,0,0,0,0,0,0,0,0,0,0,0,0,0,0,0,0,0,0,0,0,0,0,0,0,0,0,0,0,0,0,0,0,0,0,0,0,0,0,0,0,0,0,0,null,1,0,0,{"$f":"IF($B328=0,\"\",IF(F328=1,LEFT($B$2,LEN($B$2)-1),LEFT($B$3,LEN($B$3)-1)))","v":""},"p","p",0]
["",0,0,0,0,null,null,null,null,null,"",{"$error":"#VALUE!"},"",{"$error":"#VALUE!"},"",{"$error":"#VALUE!"},"","","",{"$f":"IF(V329>0,COUNTIF(Q$7:Q329,\"=\"&Q329)-1,\"\")","v":""},"",0,0,0,0,0,0,0,0,0,0,0,0,0,0,0,0,0,0,0,0,0,0,0,0,0,0,0,0,0,0,0,0,0,0,0,0,0,0,0,0,0,0,0,0,0,0,0,0,0,0,0,0,0,0,0,0,0,0,0,0,0,0,0,0,0,0,0,0,0,0,0,0,0,0,0,0,0,0,0,null,1,0,0,"","p","p",0]
["",0,0,0,0,null,null,null,null,null,"",{"$error":"#VALUE!"},"",{"$error":"#VALUE!"},"",{"$error":"#VALUE!"},"","","",{"$f":"IF(V330>0,COUNTIF(Q$7:Q330,\"=\"&Q330)-1,\"\")","v":""},"",0,0,0,0,0,0,0,0,0,0,0,0,0,0,0,0,0,0,0,0,0,0,0,0,0,0,0,0,0,0,0,0,0,0,0,0,0,0,0,0,0,0,0,0,0,0,0,0,0,0,0,0,0,0,0,0,0,0,0,0,0,0,0,0,0,0,0,0,0,0,0,0,0,0,0,0,0,0,0,null,1,0,0,"","p","p",0]
["",0,0,0,0,null,null,null,null,null,"",{"$error":"#VALUE!"},"",{"$error":"#VALUE!"},"",{"$error":"#VALUE!"},"","","",{"$f":"IF(V331>0,COUNTIF(Q$7:Q331,\"=\"&Q331)-1,\"\")","v":""},"",0,0,0,0,0,0,0,0,0,0,0,0,0,0,0,0,0,0,0,0,0,0,0,0,0,0,0,0,0,0,0,0,0,0,0,0,0,0,0,0,0,0,0,0,0,0,0,0,0,0,0,0,0,0,0,0,0,0,0,0,0,0,0,0,0,0,0,0,0,0,0,0,0,0,0,0,0,0,0,null,1,0,0,"","p","p",0]
["",0,0,0,0,null,null,null,null,null,"",{"$error":"#VALUE!"},"",{"$error":"#VALUE!"},"",{"$error":"#VALUE!"},"","","",{"$f":"IF(V332>0,COUNTIF(Q$7:Q332,\"=\"&Q332)-1,\"\")","v":""},"",0,0,0,0,0,0,0,0,0,0,0,0,0,0,0,0,0,0,0,0,0,0,0,0,0,0,0,0,0,0,0,0,0,0,0,0,0,0,0,0,0,0,0,0,0,0,0,0,0,0,0,0,0,0,0,0,0,0,0,0,0,0,0,0,0,0,0,0,0,0,0,0,0,0,0,0,0,0,0,null,1,0,0,"","p","p",0]
["",0,0,0,0,null,null,null,null,null,"",{"$error":"#VALUE!"},"",{"$error":"#VALUE!"},"",{"$error":"#VALUE!"},"","","",{"$f":"IF(V333>0,COUNTIF(Q$7:Q333,\"=\"&Q333)-1,\"\")","v":""},"",0,0,0,0,0,0,0,0,0,0,0,0,0,0,0,0,0,0,0,0,0,0,0,0,0,0,0,0,0,0,0,0,0,0,0,0,0,0,0,0,0,0,0,0,0,0,0,0,0,0,0,0,0,0,0,0,0,0,0,0,0,0,0,0,0,0,0,0,0,0,0,0,0,0,0,0,0,0,0,null,1,0,0,"","p","p",0]
["",0,0,0,0,null,null,null,null,null,"",{"$error":"#VALUE!"},"",{"$error":"#VALUE!"},"",{"$error":"#VALUE!"},"","","",{"$f":"IF(V334>0,COUNTIF(Q$7:Q334,\"=\"&Q334)-1,\"\")","v":""},"",0,0,0,0,0,0,0,0,0,0,0,0,0,0,0,0,0,0,0,0,0,0,0,0,0,0,0,0,0,0,0,0,0,0,0,0,0,0,0,0,0,0,0,0,0,0,0,0,0,0,0,0,0,0,0,0,0,0,0,0,0,0,0,0,0,0,0,0,0,0,0,0,0,0,0,0,0,0,0,null,1,0,0,"","p","p",0]
["",0,0,0,0,null,null,null,null,null,"",{"$error":"#VALUE!"},"",{"$error":"#VALUE!"},"",{"$error":"#VALUE!"},"","","",{"$f":"IF(V335>0,COUNTIF(Q$7:Q335,\"=\"&Q335)-1,\"\")","v":""},"",0,0,0,0,0,0,0,0,0,0,0,0,0,0,0,0,0,0,0,0,0,0,0,0,0,0,0,0,0,0,0,0,0,0,0,0,0,0,0,0,0,0,0,0,0,0,0,0,0,0,0,0,0,0,0,0,0,0,0,0,0,0,0,0,0,0,0,0,0,0,0,0,0,0,0,0,0,0,0,null,1,0,0,"","p","p",0]
["",0,0,0,0,null,null,null,null,null,"",{"$error":"#VALUE!"},"",{"$error":"#VALUE!"},"",{"$error":"#VALUE!"},"","","",{"$f":"IF(V336>0,COUNTIF(Q$7:Q336,\"=\"&Q336)-1,\"\")","v":""},"",0,0,0,0,0,0,0,0,0,0,0,0,0,0,0,0,0,0,0,0,0,0,0,0,0,0,0,0,0,0,0,0,0,0,0,0,0,0,0,0,0,0,0,0,0,0,0,0,0,0,0,0,0,0,0,0,0,0,0,0,0,0,0,0,0,0,0,0,0,0,0,0,0,0,0,0,0,0,0,null,1,0,0,"","p","p",0]
["",0,0,0,0,null,null,null,null,null,"",{"$error":"#VALUE!"},"",{"$error":"#VALUE!"},"",{"$error":"#VALUE!"},"","","",{"$f":"IF(V337>0,COUNTIF(Q$7:Q337,\"=\"&Q337)-1,\"\")","v":""},"",0,{"$f":"$V337-LEN(SUBSTITUTE($J337,W$4,\"\"))","v":0},0,0,0,0,{"$f":"IF($CZ337>0,$V337-LEN(SUBSTITUTE($J337,AB$4,\"\")),0)","v":0},0,0,0,0,0,0,0,0,0,{"$f":"IF($CZ337>0,$V337-LEN(SUBSTITUTE($J337,AL$4,\"\")),0)","v":0},0,0,0,0,0,0,0,0,0,{"$f":"IF($CZ337>0,$V337-LEN(SUBSTITUTE($J337,AV$4,\"\")),0)","v":0},0,0,0,0,0,0,0,0,0,0,0,0,{"$f":"IF($CZ337>0,$V337-LEN(SUBSTITUTE($J337,BI$4,\"\")),0)","v":0},0,0,0,0,0,0,0,0,0,{"$f":"IF($CZ337>0,$V337-LEN(SUBSTITUTE($J337,BS$4,\"\")),0)","v":0},0,0,0,0,0,0,0,0,0,{"$f":"IF($CZ337>0,$V337-LEN(SUBSTITUTE($J337,CC$4,\"\")),0)","v":0},0,0,0,0,0,0,0,0,0,0,0,0,0,0,0,0,0,0,0,null,1,0,0,"","p","p",0]
["",0,0,0,0,null,null,null,null,null,"",{"$error":"#VALUE!"},"",{"$error":"#VALUE!"},"",{"$error":"#VALUE!"},"","","",{"$f":"IF(V338>0,COUNTIF(Q$7:Q338,\"=\"&Q338)-1,\"\")","v":""},"",0,0,0,0,0,0,0,0,0,0,0,0,0,0,0,0,0,0,0,0,0,0,0,0,0,0,0,0,0,0,0,0,0,0,0,0,0,0,0,0,0,0,0,0,0,0,0,0,0,0,0,0,0,0,0,0,0,0,0,0,0,0,0,0,0,0,0,0,0,0,0,0,0,0,0,0,0,0,0,null,1,0,0,"","p","p",0]
["",0,0,0,0,null,null,null,null,null,"",{"$error":"#VALUE!"},"",{"$error":"#VALUE!"},"",{"$error":"#VALUE!"},"","","",{"$f":"IF(V339>0,COUNTIF(Q$7:Q339,\"=\"&Q339)-1,\"\")","v":""},"",0,0,0,0,0,0,0,0,0,0,0,0,0,0,0,0,0,0,0,0,0,0,0,0,0,0,0,0,0,0,0,0,0,0,0,0,0,0,0,0,0,0,0,0,0,0,0,0,0,0,0,0,0,0,0,0,0,0,0,0,0,0,0,0,0,0,0,0,0,0,0,0,0,0,0,0,0,0,0,null,1,0,0,"","p","p",0]
["",0,0,0,0,null,null,null,null,null,"",{"$error":"#VALUE!"},"",{"$error":"#VALUE!"},"",{"$error":"#VALUE!"},"","","",{"$f":"IF(V340>0,COUNTIF(Q$7:Q340,\"=\"&Q340)-1,\"\")","v":""},"",0,0,0,0,0,0,0,0,0,0,0,0,0,0,0,0,0,0,0,0,0,0,0,0,0,0,0,0,0,0,0,0,0,0,0,0,0,0,0,0,0,0,0,0,0,0,0,0,0,0,0,0,0,0,0,0,0,0,0,0,0,0,0,0,0,0,0,0,0,0,0,0,0,0,0,0,0,0,0,null,1,0,0,"","p","p",0]
["",0,0,0,0,null,null,null,null,null,"",{"$error":"#VALUE!"},"",{"$error":"#VALUE!"},"",{"$error":"#VALUE!"},"","","",{"$f":"IF(V341>0,COUNTIF(Q$7:Q341,\"=\"&Q341)-1,\"\")","v":""},"",0,0,0,0,0,0,0,0,0,0,0,0,0,0,0,0,0,0,0,0,0,0,0,0,0,0,0,0,0,0,0,0,0,0,0,0,0,0,0,0,0,0,0,0,0,0,0,0,0,0,0,0,0,0,0,0,0,0,0,0,0,0,0,0,0,0,0,0,0,0,0,0,0,0,0,0,0,0,0,null,1,0,0,"","p","p",0]
["",0,0,0,0,null,null,null,null,null,"",{"$error":"#VALUE!"},"",{"$error":"#VALUE!"},"",{"$error":"#VALUE!"},"","","",{"$f":"IF(V342>0,COUNTIF(Q$7:Q342,\"=\"&Q342)-1,\"\")","v":""},"",0,0,0,0,0,0,0,0,0,0,0,0,0,0,0,0,0,0,0,0,0,0,0,0,0,0,0,0,0,0,0,0,0,0,0,0,0,0,0,0,0,0,0,0,0,0,0,0,0,0,0,0,0,0,0,0,0,0,0,0,0,0,0,0,0,0,0,0,0,0,0,0,0,0,0,0,0,0,0,null,1,0,0,"","p","p",0]
["",0,0,0,0,null,null,null,null,null,"",{"$error":"#VALUE!"},"",{"$error":"#VALUE!"},"",{"$error":"#VALUE!"},"","","",{"$f":"IF(V343>0,COUNTIF(Q$7:Q343,\"=\"&Q343)-1,\"\")","v":""},"",0,0,0,0,0,0,0,0,0,0,0,0,0,0,0,0,0,0,0,0,0,0,0,0,0,0,0,0,0,0,0,0,0,0,0,0,0,0,0,0,0,0,0,0,0,0,0,0,0,0,0,0,0,0,0,0,0,0,0,0,0,0,0,0,0,0,0,0,0,0,0,0,0,0,{"$f":"IF($CZ343>0,$V343-LEN(SUBSTITUTE($J343,CR$4,\"\")),0)","v":0},0,0,0,0,null,1,0,0,"","p","p",0]
["",0,0,0,0,null,null,null,null,null,"",{"$error":"#VALUE!"},"",{"$error":"#VALUE!"},"",{"$error":"#VALUE!"},"","","",{"$f":"IF(V344>0,COUNTIF(Q$7:Q344,\"=\"&Q344)-1,\"\")","v":""},"",0,0,0,0,0,0,0,0,0,0,0,0,0,0,0,0,0,0,0,0,0,0,0,0,0,0,0,0,0,0,0,0,0,0,0,0,0,0,0,0,0,0,0,0,0,0,0,0,0,0,0,0,0,0,0,0,0,0,0,0,0,0,0,0,0,0,0,0,0,0,0,0,0,0,0,0,0,0,0,null,1,0,0,"","p","p",0]
["",0,0,0,0,null,null,null,null,null,"",{"$error":"#VALUE!"},"",{"$error":"#VALUE!"},"",{"$error":"#VALUE!"},"","","",{"$f":"IF(V345>0,COUNTIF(Q$7:Q345,\"=\"&Q345)-1,\"\")","v":""},"",0,0,0,0,0,0,0,0,0,0,0,0,0,0,0,0,0,0,0,0,0,0,0,0,0,0,0,0,0,0,0,0,0,0,0,0,0,0,0,0,0,0,0,0,0,0,0,0,0,0,0,0,0,0,0,0,0,0,0,0,0,0,0,0,0,0,0,0,0,0,0,0,0,0,0,0,0,0,0,null,1,0,0,"","p","p",0]
["",0,0,0,0,null,null,null,null,null,"",{"$error":"#VALUE!"},"",{"$error":"#VALUE!"},"",{"$error":"#VALUE!"},"","","",{"$f":"IF(V346>0,COUNTIF(Q$7:Q346,\"=\"&Q346)-1,\"\")","v":""},"",0,0,0,0,0,0,0,0,0,0,0,0,0,0,0,0,0,0,0,0,0,0,0,0,0,0,0,0,0,0,0,0,0,0,0,0,0,0,0,0,0,0,0,0,0,0,0,0,0,0,0,0,0,0,0,0,0,0,0,0,0,0,0,0,0,0,0,0,0,0,0,0,0,0,0,0,0,0,0,null,1,0,0,"","p","p",0]
["",0,0,0,0,null,null,null,null,null,"",{"$error":"#VALUE!"},"",{"$error":"#VALUE!"},"",{"$error":"#VALUE!"},"","","",{"$f":"IF(V347>0,COUNTIF(Q$7:Q347,\"=\"&Q347)-1,\"\")","v":""},"",0,0,0,0,0,0,{"$f":"IF($CZ347>0,$V347-LEN(SUBSTITUTE($J347,AB$4,\"\")),0)","v":0},0,0,0,0,0,0,0,0,0,{"$f":"IF($CZ347>0,$V347-LEN(SUBSTITUTE($J347,AL$4,\"\")),0)","v":0},0,0,0,0,0,0,0,0,0,{"$f":"IF($CZ347>0,$V347-LEN(SUBSTITUTE($J347,AV$4,\"\")),0)","v":0},0,0,0,0,0,0,0,0,0,0,0,0,{"$f":"IF($CZ347>0,$V347-LEN(SUBSTITUTE($J347,BI$4,\"\")),0)","v":0},0,0,0,0,0,0,0,0,0,{"$f":"IF($CZ347>0,$V347-LEN(SUBSTITUTE($J347,BS$4,\"\")),0)","v":0},0,0,0,0,0,0,0,0,0,{"$f":"IF($CZ347>0,$V347-LEN(SUBSTITUTE($J347,CC$4,\"\")),0)","v":0},0,0,0,0,0,0,0,0,0,0,{"$f":"IF($CZ347>0,$V347-LEN(SUBSTITUTE($J347,CN$4,\"\")),0)","v":0},0,0,0,0,0,0,0,0,null,1,0,0,"","p","p",0]
["",0,0,0,0,null,null,null,null,null,"",{"$error":"#VALUE!"},"",{"$error":"#VALUE!"},"",{"$error":"#VALUE!"},"","","",{"$f":"IF(V348>0,COUNTIF(Q$7:Q348,\"=\"&Q348)-1,\"\")","v":""},"",0,0,0,0,0,0,0,0,0,0,0,0,0,0,0,0,0,0,0,0,0,0,0,0,0,0,0,0,0,0,0,0,0,0,0,0,0,0,0,0,0,0,0,0,0,0,0,0,0,0,0,0,0,0,0,0,0,0,0,0,0,0,0,0,0,0,0,0,0,0,0,0,0,0,0,0,0,0,0,null,1,0,0,"","p","p",0]
["",0,0,0,0,null,null,null,null,null,"",{"$error":"#VALUE!"},"",{"$error":"#VALUE!"},"",{"$error":"#VALUE!"},"","","",{"$f":"IF(V349>0,COUNTIF(Q$7:Q349,\"=\"&Q349)-1,\"\")","v":""},"",0,0,0,0,0,0,0,0,0,0,0,0,0,0,0,0,0,0,0,0,0,0,0,0,0,0,0,0,0,0,0,0,0,0,0,0,0,0,0,0,0,0,0,0,0,0,0,0,0,0,0,0,0,0,0,0,0,0,0,0,0,0,0,0,0,0,0,0,0,0,0,0,0,0,0,0,0,0,0,null,1,0,0,"","p","p",0]
["",0,0,0,0,null,null,null,null,null,"",{"$error":"#VALUE!"},"",{"$error":"#VALUE!"},"",{"$error":"#VALUE!"},"","","",{"$f":"IF(V350>0,COUNTIF(Q$7:Q350,\"=\"&Q350)-1,\"\")","v":""},"",0,0,0,0,0,0,0,0,0,0,0,0,0,0,0,0,0,0,0,0,0,0,0,0,0,0,0,0,0,0,0,0,0,0,0,0,0,0,0,0,0,0,0,0,0,0,0,0,0,0,0,0,0,0,0,0,0,0,0,0,0,0,0,0,0,0,0,0,0,0,0,0,0,0,0,0,0,0,0,null,1,0,0,"","p","p",0]
[{"$f":"IF(V351=0,\"\",A350+1)","v":""},0,0,0,0,null,null,null,null,null,{"$f":"IF(V351=0,\"\",SUMPRODUCT(W$5:CY$5,W351:CY351))","v":""},{"$f":"IF(C351=-1,\"\",K351-18.01528)","v":{"$error":"#VALUE!"}},{"$f":"IF(V351=0,\"\",SUMPRODUCT(W$6:CY$6,W351:CY351))","v":""},{"$f":"IF(C351=-1,\"\",M351-18.0105646861)","v":{"$error":"#VALUE!"}},{"$f":"IF(V351=0,\"\",M351+TRUNC(K351-M351-0.1))","v":""},{"$f":"IF(C351=-1,\"\",O351-18.0105646861)","v":{"$error":"#VALUE!"}},{"$f":"IF(V351>0,ROUND(K351,4),\"\")","v":""},{"$f":"IF(V351>0,S351+T351,\"\")","v":""},"",{"$f":"IF(V351>0,COUNTIF(Q$7:Q351,\"=\"&Q351)-1,\"\")","v":""},{"$f":"IF(V351>0,$R$6-R351+1,\"\")","v":""},{"$f":"LEN(J351)","v":0},0,0,0,0,0,0,0,0,0,0,0,0,0,0,0,0,0,0,0,0,0,0,0,0,0,0,0,0,0,0,0,0,0,0,0,0,0,{"$f":"IF($CZ351>0,$V351-LEN(SUBSTITUTE($J351,BH$4,\"\")),0)+DD351","v":0},0,0,0,0,0,0,0,0,0,0,0,0,0,0,0,0,0,0,0,0,0,0,0,0,0,0,0,0,0,0,0,0,0,0,0,0,0,0,0,{"$f":"V351+B351+C351","v":0},null,{"$f":"-(V351-1)+D351","v":1},{"$f":"E351","v":0},0,{"$f":"IF($B351=0,\"\",IF(F351=1,LEFT($B$2,LEN($B$2)-1),LEFT($B$3,LEN($B$3)-1)))","v":""},"p",{"$f":"DA351&J351&DB351","v":"p"},0]
["",0,0,0,0,null,null,null,null,null,"",{"$error":"#VALUE!"},"",{"$error":"#VALUE!"},"",{"$error":"#VALUE!"},"","","",{"$f":"IF(V352>0,COUNTIF(Q$7:Q352,\"=\"&Q352)-1,\"\")","v":""},"",0,0,0,0,0,0,0,0,0,0,0,0,0,0,0,0,0,0,0,0,0,0,0,0,0,0,0,0,0,0,0,0,0,0,0,0,0,0,0,0,0,0,0,0,0,0,0,0,0,0,0,0,0,0,0,0,0,0,0,0,0,0,0,0,0,0,0,0,0,0,0,0,0,0,0,0,0,0,0,null,1,0,0,"","p","p",0]
["",0,0,0,0,null,null,null,null,null,"",{"$error":"#VALUE!"},"",{"$error":"#VALUE!"},"",{"$error":"#VALUE!"},"","","",{"$f":"IF(V353>0,COUNTIF(Q$7:Q353,\"=\"&Q353)-1,\"\")","v":""},"",0,{"$f":"$V353-LEN(SUBSTITUTE($J353,W$4,\"\"))","v":0},0,0,0,0,0,0,0,0,0,0,0,0,0,0,0,0,0,0,0,0,0,0,0,0,0,0,0,0,0,0,0,0,0,0,0,0,0,0,0,0,0,0,0,0,0,0,0,0,0,0,0,0,0,0,0,0,0,0,0,0,0,0,0,0,0,0,0,0,0,0,0,0,0,0,0,0,0,null,1,0,0,"","p","p",0]
["",0,0,0,0,null,null,null,null,null,"",{"$error":"#VALUE!"},"",{"$error":"#VALUE!"},"",{"$error":"#VALUE!"},"","","",{"$f":"IF(V354>0,COUNTIF(Q$7:Q354,\"=\"&Q354)-1,\"\")","v":""},"",0,0,0,0,0,0,0,0,0,0,0,0,0,0,0,0,0,0,0,0,0,0,0,0,0,0,0,0,0,0,0,0,0,0,0,0,0,0,0,0,0,0,0,0,0,0,0,0,0,0,0,0,0,0,0,0,0,0,0,0,0,0,0,0,0,0,0,0,0,0,0,0,0,0,0,0,0,0,0,null,1,0,0,"","p","p",0]
["",0,0,0,0,null,null,null,null,null,"",{"$error":"#VALUE!"},"",{"$error":"#VALUE!"},"",{"$error":"#VALUE!"},"","","",{"$f":"IF(V355>0,COUNTIF(Q$7:Q355,\"=\"&Q355)-1,\"\")","v":""},"",0,0,0,0,0,0,0,0,0,0,0,0,0,0,0,0,0,0,0,0,0,0,0,0,0,0,0,0,0,0,0,0,0,0,0,0,0,0,0,0,0,0,0,0,0,0,0,0,0,0,0,0,0,0,0,0,0,0,0,0,0,0,0,0,0,0,0,0,0,0,0,0,0,0,0,0,0,0,0,null,1,0,0,"","p","p",0]
["",0,0,0,0,null,null,null,null,null,"",{"$error":"#VALUE!"},"",{"$error":"#VALUE!"},"",{"$error":"#VALUE!"},"","","",{"$f":"IF(V356>0,COUNTIF(Q$7:Q356,\"=\"&Q356)-1,\"\")","v":""},"",0,0,0,0,0,0,0,0,0,0,0,0,0,0,0,0,0,0,0,0,0,0,0,0,0,0,0,0,0,0,0,0,0,0,0,0,0,0,0,0,0,0,0,0,0,0,0,0,0,0,0,0,0,0,0,0,0,0,0,0,0,0,0,0,0,0,0,0,0,0,0,0,0,0,0,0,0,0,0,null,1,0,0,"","p","p",0]
["",0,0,0,0,null,null,null,null,null,"",{"$error":"#VALUE!"},"",{"$error":"#VALUE!"},"",{"$error":"#VALUE!"},"","","",{"$f":"IF(V357>0,COUNTIF(Q$7:Q357,\"=\"&Q357)-1,\"\")","v":""},"",0,0,0,0,0,0,{"$f":"IF($CZ357>0,$V357-LEN(SUBSTITUTE($J357,AB$4,\"\")),0)","v":0},0,0,0,0,0,0,0,0,0,{"$f":"IF($CZ357>0,$V357-LEN(SUBSTITUTE($J357,AL$4,\"\")),0)","v":0},0,0,0,0,0,0,0,0,0,{"$f":"IF($CZ357>0,$V357-LEN(SUBSTITUTE($J357,AV$4,\"\")),0)","v":0},0,0,0,0,0,0,0,0,0,0,0,0,{"$f":"IF($CZ357>0,$V357-LEN(SUBSTITUTE($J357,BI$4,\"\")),0)","v":0},0,0,0,0,0,0,0,0,0,{"$f":"IF($CZ357>0,$V357-LEN(SUBSTITUTE($J357,BS$4,\"\")),0)","v":0},0,0,0,0,0,0,0,0,0,{"$f":"IF($CZ357>0,$V357-LEN(SUBSTITUTE($J357,CC$4,\"\")),0)","v":0},0,0,0,0,0,0,0,0,0,0,0,0,0,0,0,0,0,0,0,null,1,0,0,"","p","p",0]
["",0,0,0,0,null,null,null,null,null,"",{"$error":"#VALUE!"},"",{"$error":"#VALUE!"},"",{"$error":"#VALUE!"},"","","",{"$f":"IF(V358>0,COUNTIF(Q$7:Q358,\"=\"&Q358)-1,\"\")","v":""},"",0,0,0,0,0,0,0,0,0,0,0,0,0,0,0,0,0,0,0,0,0,0,0,0,0,0,0,0,0,0,0,0,0,0,0,0,0,0,0,0,0,0,0,0,0,0,0,0,0,0,0,0,0,0,0,0,0,0,0,0,0,0,0,0,0,0,0,0,0,0,0,0,0,0,0,0,0,0,0,null,1,0,0,"","p","p",0]
["",0,0,0,0,null,null,null,null,null,"",{"$error":"#VALUE!"},"",{"$error":"#VALUE!"},"",{"$error":"#VALUE!"},"","","",{"$f":"IF(V359>0,COUNTIF(Q$7:Q359,\"=\"&Q359)-1,\"\")","v":""},"",0,0,0,0,0,0,0,0,0,0,0,0,0,0,0,0,0,0,0,0,0,0,0,0,0,0,0,0,0,0,0,0,0,0,0,0,0,0,0,0,0,0,0,0,0,0,0,0,0,0,0,0,0,0,0,0,0,0,0,0,0,0,0,0,0,0,0,0,0,0,0,0,0,0,{"$f":"IF($CZ359>0,$V359-LEN(SUBSTITUTE($J359,CR$4,\"\")),0)","v":0},0,0,0,0,null,1,0,0,"","p","p",0]
[{"$f":"IF(V360=0,\"\",A359+1)","v":""},0,0,0,0,null,null,null,null,null,{"$f":"IF(V360=0,\"\",SUMPRODUCT(W$5:CY$5,W360:CY360))","v":""},{"$f":"IF(C360=-1,\"\",K360-18.01528)","v":{"$error":"#VALUE!"}},{"$f":"IF(V360=0,\"\",SUMPRODUCT(W$6:CY$6,W360:CY360))","v":""},{"$f":"IF(C360=-1,\"\",M360-18.0105646861)","v":{"$error":"#VALUE!"}},{"$f":"IF(V360=0,\"\",M360+TRUNC(K360-M360-0.1))","v":""},{"$f":"IF(C360=-1,\"\",O360-18.0105646861)","v":{"$error":"#VALUE!"}},{"$f":"IF(V360>0,ROUND(K360,4),\"\")","v":""},{"$f":"IF(V360>0,S360+T360,\"\")","v":""},"",{"$f":"IF(V360>0,COUNTIF(Q$7:Q360,\"=\"&Q360)-1,\"\")","v":""},{"$f":"IF(V360>0,$R$6-R360+1,\"\")","v":""},{"$f":"LEN(J360)","v":0},0,0,0,0,0,0,0,0,0,0,0,0,0,0,0,0,0,0,0,0,0,0,0,0,0,0,0,0,0,0,0,0,0,0,0,0,0,{"$f":"IF($CZ360>0,$V360-LEN(SUBSTITUTE($J360,BH$4,\"\")),0)+DD360","v":0},0,0,0,0,0,0,0,0,0,0,0,0,0,0,0,0,0,0,0,0,0,0,0,0,0,0,0,0,0,0,0,0,0,0,0,0,0,0,0,{"$f":"V360+B360+C360","v":0},null,{"$f":"-(V360-1)+D360","v":1},{"$f":"E360","v":0},0,{"$f":"IF($B360=0,\"\",IF(F360=1,LEFT($B$2,LEN($B$2)-1),LEFT($B$3,LEN($B$3)-1)))","v":""},"p",{"$f":"DA360&J360&DB360","v":"p"},0]
["",0,0,0,0,null,null,null,null,null,"",{"$error":"#VALUE!"},"",{"$error":"#VALUE!"},"",{"$error":"#VALUE!"},"","","",{"$f":"IF(V361>0,COUNTIF(Q$7:Q361,\"=\"&Q361)-1,\"\")","v":""},"",0,0,0,0,0,0,0,0,0,0,0,0,0,0,0,0,0,0,0,0,0,0,0,0,0,0,0,0,0,0,0,0,0,0,0,0,0,0,0,0,0,0,0,0,0,0,0,0,0,0,0,0,0,0,0,0,0,0,0,0,0,0,0,0,0,0,0,0,0,0,0,0,0,0,0,0,0,0,0,null,1,0,0,"","p","p",0]
["",0,0,0,0,null,null,null,null,null,"",{"$error":"#VALUE!"},"",{"$error":"#VALUE!"},"",{"$error":"#VALUE!"},"","","",{"$f":"IF(V362>0,COUNTIF(Q$7:Q362,\"=\"&Q362)-1,\"\")","v":""},"",0,0,0,0,0,0,0,0,0,0,0,0,0,0,0,0,0,0,0,0,0,0,0,0,0,0,0,0,0,0,0,0,0,0,0,0,0,0,0,0,0,0,0,0,0,0,0,0,0,0,0,0,0,0,0,0,0,0,0,0,0,0,0,0,0,0,0,0,0,0,0,0,0,0,0,0,0,0,0,null,1,0,0,"","p","p",0]
["",0,0,0,0,null,null,null,null,null,"",{"$error":"#VALUE!"},"",{"$error":"#VALUE!"},"",{"$error":"#VALUE!"},"","","",{"$f":"IF(V363>0,COUNTIF(Q$7:Q363,\"=\"&Q363)-1,\"\")","v":""},"",0,0,0,0,0,0,0,0,0,0,0,0,0,0,0,0,0,0,0,0,0,0,0,0,0,0,0,0,0,0,0,0,0,0,0,0,0,0,0,0,0,0,0,0,0,0,0,0,0,0,0,0,0,0,0,0,0,0,0,0,0,0,0,0,0,0,0,0,0,0,0,0,0,0,0,0,0,0,0,null,1,0,0,"","p","p",0]
["",0,0,0,0,null,null,null,null,null,"",{"$error":"#VALUE!"},"",{"$error":"#VALUE!"},"",{"$error":"#VALUE!"},"","","",{"$f":"IF(V364>0,COUNTIF(Q$7:Q364,\"=\"&Q364)-1,\"\")","v":""},"",0,0,0,0,0,0,0,0,0,0,0,0,0,0,0,0,0,0,0,0,0,0,0,0,0,0,0,0,0,0,0,0,0,0,0,0,0,0,0,0,0,0,0,0,0,0,0,0,0,0,0,0,0,0,0,0,0,0,0,0,0,0,0,0,0,0,0,0,0,0,0,0,0,0,0,0,0,0,0,null,1,0,0,"","p","p",0]
["",0,0,0,0,null,null,null,null,null,"",{"$error":"#VALUE!"},"",{"$error":"#VALUE!"},"",{"$error":"#VALUE!"},"","","",{"$f":"IF(V365>0,COUNTIF(Q$7:Q365,\"=\"&Q365)-1,\"\")","v":""},"",0,0,0,0,0,0,0,0,0,0,0,0,0,0,0,0,0,0,0,0,0,0,0,0,0,0,0,0,0,0,0,0,0,0,0,0,0,0,0,0,0,0,0,0,0,0,0,0,0,0,0,0,0,0,0,0,0,0,0,0,0,0,0,0,0,0,0,0,0,0,0,0,0,0,0,0,0,0,0,null,1,0,0,"","p","p",0]
["",0,0,0,0,null,null,null,null,null,"",{"$error":"#VALUE!"},"",{"$error":"#VALUE!"},"",{"$error":"#VALUE!"},"","","",{"$f":"IF(V366>0,COUNTIF(Q$7:Q366,\"=\"&Q366)-1,\"\")","v":""},"",0,0,0,0,0,0,0,0,0,0,0,0,0,0,0,0,0,0,0,0,0,0,0,0,0,0,0,0,0,0,0,0,0,0,0,0,0,0,0,0,0,0,0,0,0,0,0,0,0,0,0,0,0,0,0,0,0,0,0,0,0,0,0,0,0,0,0,0,0,0,0,0,0,0,0,0,0,0,0,null,1,0,0,"","p","p",0]
["",0,0,0,0,null,null,null,null,null,"",{"$error":"#VALUE!"},"",{"$error":"#VALUE!"},"",{"$error":"#VALUE!"},"","","",{"$f":"IF(V367>0,COUNTIF(Q$7:Q367,\"=\"&Q367)-1,\"\")","v":""},"",0,0,0,0,0,0,{"$f":"IF($CZ367>0,$V367-LEN(SUBSTITUTE($J367,AB$4,\"\")),0)","v":0},0,0,0,0,0,0,0,0,0,{"$f":"IF($CZ367>0,$V367-LEN(SUBSTITUTE($J367,AL$4,\"\")),0)","v":0},0,0,0,0,0,0,0,0,0,{"$f":"IF($CZ367>0,$V367-LEN(SUBSTITUTE($J367,AV$4,\"\")),0)","v":0},0,0,0,0,0,0,0,0,0,0,0,0,{"$f":"IF($CZ367>0,$V367-LEN(SUBSTITUTE($J367,BI$4,\"\")),0)","v":0},0,0,0,0,0,0,0,0,0,{"$f":"IF($CZ367>0,$V367-LEN(SUBSTITUTE($J367,BS$4,\"\")),0)","v":0},0,0,0,0,0,0,0,0,0,{"$f":"IF($CZ367>0,$V367-LEN(SUBSTITUTE($J367,CC$4,\"\")),0)","v":0},0,0,0,0,0,0,0,0,0,0,{"$f":"IF($CZ367>0,$V367-LEN(SUBSTITUTE($J367,CN$4,\"\")),0)","v":0},0,0,0,0,0,0,0,0,null,1,0,0,"","p","p",0]
["",0,0,0,0,null,null,null,null,null,"",{"$error":"#VALUE!"},"",{"$error":"#VALUE!"},"",{"$error":"#VALUE!"},"","","",{"$f":"IF(V368>0,COUNTIF(Q$7:Q368,\"=\"&Q368)-1,\"\")","v":""},"",0,0,0,0,0,0,0,0,0,0,0,0,0,0,0,0,0,0,0,0,0,0,0,0,0,0,0,0,0,0,0,0,0,0,0,0,0,0,0,0,0,0,0,0,0,0,0,0,0,0,0,0,0,0,0,0,0,0,0,0,0,0,0,0,0,0,0,0,0,0,0,0,0,0,0,0,0,0,0,null,1,0,0,"","p","p",0]
["",0,0,0,0,null,null,null,null,null,"",{"$error":"#VALUE!"},"",{"$error":"#VALUE!"},"",{"$error":"#VALUE!"},"","","",{"$f":"IF(V369>0,COUNTIF(Q$7:Q369,\"=\"&Q369)-1,\"\")","v":""},"",0,{"$f":"$V369-LEN(SUBSTITUTE($J369,W$4,\"\"))","v":0},0,0,0,0,0,0,0,0,0,0,0,0,0,0,0,0,0,0,0,0,0,0,0,0,0,0,0,0,0,0,0,0,0,0,0,0,0,0,0,0,0,0,0,0,0,0,0,0,0,0,0,0,0,0,0,0,0,0,0,0,0,0,0,0,0,0,0,0,0,0,0,0,0,0,0,0,0,null,1,0,0,"","p","p",0]
["",0,0,0,0,null,null,null,null,null,"",{"$error":"#VALUE!"},"",{"$error":"#VALUE!"},"",{"$error":"#VALUE!"},"","","",{"$f":"IF(V370>0,COUNTIF(Q$7:Q370,\"=\"&Q370)-1,\"\")","v":""},"",0,0,0,0,0,0,0,0,0,0,0,0,0,0,0,0,0,0,0,0,0,0,0,0,0,0,0,0,0,0,0,0,0,0,0,0,0,0,0,0,0,0,0,0,0,0,0,0,0,0,0,0,0,0,0,0,0,0,0,0,0,0,0,0,0,0,0,0,0,0,0,0,0,0,0,0,0,0,0,null,1,0,0,"","p","p",0]
["",0,0,0,0,null,null,null,null,null,"",{"$error":"#VALUE!"},"",{"$error":"#VALUE!"},"",{"$error":"#VALUE!"},"","","",{"$f":"IF(V371>0,COUNTIF(Q$7:Q371,\"=\"&Q371)-1,\"\")","v":""},"",0,0,0,0,0,0,0,0,0,0,0,0,0,0,0,0,0,0,0,0,0,0,0,0,0,0,0,0,0,0,0,0,0,0,0,0,0,0,0,0,0,0,0,0,0,0,0,0,0,0,0,0,0,0,0,0,0,0,0,0,0,0,0,0,0,0,0,0,0,0,0,0,0,0,0,0,0,0,0,null,1,0,0,"","p","p",0]
["",0,0,0,0,null,null,null,null,null,"",{"$error":"#VALUE!"},"",{"$error":"#VALUE!"},"",{"$error":"#VALUE!"},"","","",{"$f":"IF(V372>0,COUNTIF(Q$7:Q372,\"=\"&Q372)-1,\"\")","v":""},"",0,0,0,0,0,0,0,0,0,0,0,0,0,0,0,0,0,0,0,0,0,0,0,0,0,0,0,0,0,0,0,0,0,0,0,0,0,0,0,0,0,0,0,0,0,0,0,0,0,0,0,0,0,0,0,0,0,0,0,0,0,0,0,0,0,0,0,0,0,0,0,0,0,0,0,0,0,0,0,null,1,0,0,"","p","p",0]
["",0,0,0,0,null,null,null,null,null,"",{"$error":"#VALUE!"},"",{"$error":"#VALUE!"},"",{"$error":"#VALUE!"},"","","",{"$f":"IF(V373>0,COUNTIF(Q$7:Q373,\"=\"&Q373)-1,\"\")","v":""},"",0,0,0,0,0,0,0,0,0,0,0,0,0,0,0,0,0,0,0,0,0,0,0,0,0,0,0,0,0,0,0,0,0,0,0,0,0,0,0,0,0,0,0,0,0,0,0,0,0,0,0,0,0,0,0,0,0,0,0,0,0,0,0,0,0,0,0,0,0,0,0,0,0,0,0,0,0,0,0,null,1,0,0,"","p","p",0]
["",0,0,0,0,null,null,null,null,null,"",{"$error":"#VALUE!"},"",{"$error":"#VALUE!"},"",{"$error":"#VALUE!"},"","","",{"$f":"IF(V374>0,COUNTIF(Q$7:Q374,\"=\"&Q374)-1,\"\")","v":""},"",0,0,0,0,0,0,0,0,0,0,0,0,0,0,0,0,0,0,0,0,0,0,0,0,0,0,0,0,0,0,0,0,0,0,0,0,0,0,0,0,0,0,0,0,0,0,0,0,0,0,0,0,0,0,0,0,0,0,0,0,0,0,0,0,0,0,0,0,0,0,0,0,0,0,0,0,0,0,0,null,1,0,0,"","p","p",0]
["",0,0,0,0,null,null,null,null,null,"",{"$error":"#VALUE!"},"",{"$error":"#VALUE!"},"",{"$error":"#VALUE!"},"","","",{"$f":"IF(V375>0,COUNTIF(Q$7:Q375,\"=\"&Q375)-1,\"\")","v":""},"",0,0,0,0,0,0,0,0,0,0,0,0,0,0,0,0,0,0,0,0,0,0,0,0,0,0,0,0,0,0,0,0,0,0,0,0,0,0,0,0,0,0,0,0,0,0,0,0,0,0,0,0,0,0,0,0,0,0,0,0,0,0,0,0,0,0,0,0,0,0,0,0,0,0,{"$f":"IF($CZ375>0,$V375-LEN(SUBSTITUTE($J375,CR$4,\"\")),0)","v":0},0,0,0,0,null,1,0,0,"","p","p",0]
["",0,0,0,0,null,null,null,null,null,"",{"$error":"#VALUE!"},"",{"$error":"#VALUE!"},"",{"$error":"#VALUE!"},"","","",{"$f":"IF(V376>0,COUNTIF(Q$7:Q376,\"=\"&Q376)-1,\"\")","v":""},"",0,0,0,0,0,0,0,0,0,0,0,0,0,0,0,0,0,0,0,0,0,0,0,0,0,0,0,0,0,0,0,0,0,0,0,0,0,0,0,0,0,0,0,0,0,0,0,0,0,0,0,0,0,0,0,0,0,0,0,0,0,0,0,0,0,0,0,0,0,0,0,0,0,0,0,0,0,0,0,null,1,0,0,"","p","p",0]
["",0,0,0,0,null,null,null,null,null,"",{"$error":"#VALUE!"},"",{"$error":"#VALUE!"},"",{"$error":"#VALUE!"},"","","",{"$f":"IF(V377>0,COUNTIF(Q$7:Q377,\"=\"&Q377)-1,\"\")","v":""},"",0,0,0,0,0,0,{"$f":"IF($CZ377>0,$V377-LEN(SUBSTITUTE($J377,AB$4,\"\")),0)","v":0},0,0,0,0,0,0,0,0,0,{"$f":"IF($CZ377>0,$V377-LEN(SUBSTITUTE($J377,AL$4,\"\")),0)","v":0},0,0,0,0,0,0,0,0,0,{"$f":"IF($CZ377>0,$V377-LEN(SUBSTITUTE($J377,AV$4,\"\")),0)","v":0},0,0,0,0,0,0,0,0,0,0,0,0,{"$f":"IF($CZ377>0,$V377-LEN(SUBSTITUTE($J377,BI$4,\"\")),0)","v":0},0,0,0,0,0,0,0,0,0,{"$f":"IF($CZ377>0,$V377-LEN(SUBSTITUTE($J377,BS$4,\"\")),0)","v":0},0,0,0,0,0,0,0,0,0,{"$f":"IF($CZ377>0,$V377-LEN(SUBSTITUTE($J377,CC$4,\"\")),0)","v":0},0,0,0,0,0,0,0,0,0,0,0,0,0,0,0,0,0,0,0,null,1,0,0,"","p","p",0]
["",0,0,0,0,null,null,null,null,null,"",{"$error":"#VALUE!"},"",{"$error":"#VALUE!"},"",{"$error":"#VALUE!"},"","","",{"$f":"IF(V378>0,COUNTIF(Q$7:Q378,\"=\"&Q378)-1,\"\")","v":""},"",0,0,0,0,0,0,0,0,0,0,0,0,0,0,0,0,0,0,0,0,0,0,0,0,0,0,0,0,0,0,0,0,0,0,0,0,0,0,0,0,0,0,0,0,0,0,0,0,0,0,0,0,0,0,0,0,0,0,0,0,0,0,0,0,0,0,0,0,0,0,0,0,0,0,0,0,0,0,0,null,1,0,0,"","p","p",0]
["",0,0,0,0,null,null,null,null,null,"",{"$error":"#VALUE!"},"",{"$error":"#VALUE!"},"",{"$error":"#VALUE!"},"","","",{"$f":"IF(V379>0,COUNTIF(Q$7:Q379,\"=\"&Q379)-1,\"\")","v":""},"",0,0,0,0,0,0,0,0,0,0,0,0,0,0,0,0,0,0,0,0,0,0,0,0,0,0,0,0,0,0,0,0,0,0,0,0,0,0,0,0,0,0,0,0,0,0,0,0,0,0,0,0,0,0,0,0,0,0,0,0,0,0,0,0,0,0,0,0,0,0,0,0,0,0,0,0,0,0,0,null,1,0,0,"","p","p",0]
["",0,0,0,0,null,null,null,null,null,"",{"$error":"#VALUE!"},"",{"$error":"#VALUE!"},"",{"$error":"#VALUE!"},"","","",{"$f":"IF(V380>0,COUNTIF(Q$7:Q380,\"=\"&Q380)-1,\"\")","v":""},"",0,0,0,0,0,0,0,0,0,0,0,0,0,0,0,0,0,0,0,0,0,0,0,0,0,0,0,0,0,0,0,0,0,0,0,0,0,0,0,0,0,0,0,0,0,0,0,0,0,0,0,0,0,0,0,0,0,0,0,0,0,0,0,0,0,0,0,0,0,0,0,0,0,0,0,0,0,0,0,null,1,0,0,"","p","p",0]
["",0,0,0,0,null,null,null,null,null,"",{"$error":"#VALUE!"},"",{"$error":"#VALUE!"},"",{"$error":"#VALUE!"},"","","",{"$f":"IF(V381>0,COUNTIF(Q$7:Q381,\"=\"&Q381)-1,\"\")","v":""},"",0,0,0,0,0,0,0,0,0,0,0,0,0,0,0,0,0,0,0,0,0,0,0,0,0,0,0,0,0,0,0,0,0,0,0,0,0,0,0,0,0,0,0,0,0,0,0,0,0,0,0,0,0,0,0,0,0,0,0,0,0,0,0,0,0,0,0,0,0,0,0,0,0,0,0,0,0,0,0,null,1,0,0,"","p","p",0]
["",0,0,0,0,null,null,null,null,null,"",{"$error":"#VALUE!"},"",{"$error":"#VALUE!"},"",{"$error":"#VALUE!"},"","","",{"$f":"IF(V382>0,COUNTIF(Q$7:Q382,\"=\"&Q382)-1,\"\")","v":""},"",0,0,0,0,0,0,0,0,0,0,0,0,0,0,0,0,0,0,0,0,0,0,0,0,0,0,0,0,0,0,0,0,0,0,0,0,0,0,0,0,0,0,0,0,0,0,0,0,0,0,0,0,0,0,0,0,0,0,0,0,0,0,0,0,0,0,0,0,0,0,0,0,0,0,0,0,0,0,0,null,1,0,0,"","p","p",0]
["",0,0,0,0,null,null,null,null,null,"",{"$error":"#VALUE!"},"",{"$error":"#VALUE!"},"",{"$error":"#VALUE!"},"","","",{"$f":"IF(V383>0,COUNTIF(Q$7:Q383,\"=\"&Q383)-1,\"\")","v":""},"",0,0,0,0,0,0,0,0,0,0,0,0,0,0,0,0,0,0,0,0,0,0,0,0,0,0,0,0,0,0,0,0,0,0,0,0,0,0,0,0,0,0,0,0,0,0,0,0,0,0,0,0,0,0,0,0,0,0,0,0,0,0,0,0,0,0,0,0,0,0,0,0,0,0,0,0,0,0,0,null,1,0,0,"","p","p",0]
["",0,0,0,0,null,null,null,null,null,"",{"$error":"#VALUE!"},"",{"$error":"#VALUE!"},"",{"$error":"#VALUE!"},"","","",{"$f":"IF(V384>0,COUNTIF(Q$7:Q384,\"=\"&Q384)-1,\"\")","v":""},"",0,0,0,0,0,0,0,0,0,0,0,0,0,0,0,0,0,0,0,0,0,0,0,0,0,0,0,0,0,0,0,0,0,0,0,0,0,0,0,0,0,0,0,0,0,0,0,0,0,0,0,0,0,0,0,0,0,0,0,0,0,0,0,0,0,0,0,0,0,0,0,0,0,0,0,0,0,0,0,null,1,0,0,"","p","p",0]
["",0,0,0,0,null,null,null,null,null,"",{"$error":"#VALUE!"},"",{"$error":"#VALUE!"},"",{"$error":"#VALUE!"},"","","",{"$f":"IF(V385>0,COUNTIF(Q$7:Q385,\"=\"&Q385)-1,\"\")","v":""},"",0,0,0,0,0,0,0,0,0,0,0,0,0,0,0,0,0,0,0,0,0,0,0,0,0,0,0,0,0,0,0,0,0,0,0,0,0,0,0,0,0,0,0,0,0,0,0,0,0,0,0,0,0,0,0,0,0,0,0,0,0,0,0,0,0,0,0,0,0,0,0,0,0,0,0,0,0,0,0,null,1,0,0,"","p","p",0]
["",0,0,0,0,null,null,null,null,null,"",{"$error":"#VALUE!"},"",{"$error":"#VALUE!"},"",{"$error":"#VALUE!"},"","","",{"$f":"IF(V386>0,COUNTIF(Q$7:Q386,\"=\"&Q386)-1,\"\")","v":""},"",0,0,0,0,0,0,0,0,0,0,0,0,0,0,0,0,0,0,0,0,0,0,0,0,0,0,0,0,0,0,0,0,0,0,0,0,0,0,0,0,0,0,0,0,0,0,0,0,0,0,0,0,0,0,0,0,0,0,0,0,0,0,0,0,0,0,0,0,0,0,0,0,0,0,0,0,0,0,0,null,1,0,0,"","p","p",0]
["",0,0,0,0,null,null,null,null,null,"",{"$error":"#VALUE!"},"",{"$error":"#VALUE!"},"",{"$error":"#VALUE!"},"","","",{"$f":"IF(V387>0,COUNTIF(Q$7:Q387,\"=\"&Q387)-1,\"\")","v":""},"",0,0,0,0,0,0,{"$f":"IF($CZ387>0,$V387-LEN(SUBSTITUTE($J387,AB$4,\"\")),0)","v":0},0,0,0,0,0,0,0,0,0,{"$f":"IF($CZ387>0,$V387-LEN(SUBSTITUTE($J387,AL$4,\"\")),0)","v":0},0,0,0,0,0,0,0,0,0,{"$f":"IF($CZ387>0,$V387-LEN(SUBSTITUTE($J387,AV$4,\"\")),0)","v":0},0,0,0,0,0,0,0,0,0,0,0,0,{"$f":"IF($CZ387>0,$V387-LEN(SUBSTITUTE($J387,BI$4,\"\")),0)","v":0},0,0,0,0,0,0,0,0,0,{"$f":"IF($CZ387>0,$V387-LEN(SUBSTITUTE($J387,BS$4,\"\")),0)","v":0},0,0,0,0,0,0,0,0,0,{"$f":"IF($CZ387>0,$V387-LEN(SUBSTITUTE($J387,CC$4,\"\")),0)","v":0},0,0,0,0,0,0,0,0,0,0,{"$f":"IF($CZ387>0,$V387-LEN(SUBSTITUTE($J387,CN$4,\"\")),0)","v":0},0,0,0,0,0,0,0,0,null,1,0,0,"","p","p",0]
["",0,0,0,0,null,null,null,null,null,"",{"$error":"#VALUE!"},"",{"$error":"#VALUE!"},"",{"$error":"#VALUE!"},"","","",{"$f":"IF(V388>0,COUNTIF(Q$7:Q388,\"=\"&Q388)-1,\"\")","v":""},"",0,0,0,0,0,0,0,0,0,0,0,0,0,0,0,0,0,0,0,0,0,0,0,0,0,0,0,0,0,0,0,0,0,0,0,0,0,0,0,0,0,0,0,0,0,0,0,0,0,0,0,0,0,0,0,0,0,0,0,0,0,0,0,0,0,0,0,0,0,0,0,0,0,0,0,0,0,0,0,null,1,0,0,"","p","p",0]
["",0,0,0,0,null,null,null,null,null,"",{"$error":"#VALUE!"},"",{"$error":"#VALUE!"},"",{"$error":"#VALUE!"},"","","",{"$f":"IF(V389>0,COUNTIF(Q$7:Q389,\"=\"&Q389)-1,\"\")","v":""},"",0,0,0,0,0,0,0,0,0,0,0,0,0,0,0,0,0,0,0,0,0,0,0,0,0,0,0,0,0,0,0,0,0,0,0,0,0,0,0,0,0,0,0,0,0,0,0,0,0,0,0,0,0,0,0,0,0,0,0,0,0,0,0,0,0,0,0,0,0,0,0,0,0,0,0,0,0,0,0,null,1,0,0,"","p","p",0]
["",0,0,0,0,null,null,null,null,null,"",{"$error":"#VALUE!"},"",{"$error":"#VALUE!"},"",{"$error":"#VALUE!"},"","","",{"$f":"IF(V390>0,COUNTIF(Q$7:Q390,\"=\"&Q390)-1,\"\")","v":""},"",0,0,0,0,0,0,0,0,0,0,0,0,0,0,0,0,0,0,0,0,0,0,0,0,0,0,0,0,0,0,0,0,0,0,0,0,0,0,0,0,0,0,0,0,0,0,0,0,0,0,0,0,0,0,0,0,0,0,0,0,0,0,0,0,0,0,0,0,0,0,0,0,0,0,0,0,0,0,0,null,1,0,0,"","p","p",0]
["",0,{"$f":"IF($C$2=\"forced-OH\",-1,IF($G391=1,$C$3,IF($G391=2,$D$3,0)))","v":0},{"$f":"IF($F391=1,VLOOKUP($B$2,$DE$5:$DI$11,5,FALSE),0)","v":0},{"$f":"IF($F391=1,VLOOKUP($B$2,$DE$5:$DG$11,3,FALSE),0)","v":0},null,null,null,null,null,"",{"$error":"#VALUE!"},"",{"$error":"#VALUE!"},"",{"$error":"#VALUE!"},"","",{"$f":"IF(V391>0,COUNTIF(Q$7:Q$651,\"<\"&Q391)+1,\"\")","v":""},{"$f":"IF(V391>0,COUNTIF(Q$7:Q391,\"=\"&Q391)-1,\"\")","v":""},"",0,0,0,0,0,0,0,0,0,0,0,0,0,0,0,0,0,0,0,0,0,0,0,0,0,0,0,0,0,0,0,0,0,0,0,0,0,0,0,0,0,0,0,0,0,0,0,0,0,0,0,0,0,0,0,0,0,0,0,0,0,0,0,0,0,0,0,0,0,0,0,0,0,0,{"$f":"IF($CZ391>0,$V391-LEN(SUBSTITUTE($J391,CR$4,\"\")),0)","v":0},0,0,0,0,null,1,0,{"$f":"$V391-$W391-$X391-$Z391-$AA391","v":0},"",{"$f":"IF($C391=0,\"p\",\"\")","v":"p"},"p",{"$f":"IF($F391=1,VLOOKUP($B$2,$DE$5:$DH$11,4,FALSE),0)","v":0}]
["",{"$f":"IF($F392=1,VLOOKUP($B$2,$DE$5:$DG$11,2,FALSE),IF($F392=2,VLOOKUP($B$3,$DE$5:$DG$6,2,FALSE),0))","v":0},0,0,0,null,null,null,null,null,"",{"$error":"#VALUE!"},"",{"$error":"#VALUE!"},"",{"$error":"#VALUE!"},"","","",{"$f":"IF(V392>0,COUNTIF(Q$7:Q392,\"=\"&Q392)-1,\"\")","v":""},"",0,0,0,0,0,0,0,0,0,0,0,0,0,0,0,0,0,0,0,0,0,0,0,0,0,0,0,0,0,0,0,0,0,0,0,0,0,0,0,0,0,0,0,0,0,0,0,0,0,0,0,0,0,0,0,0,0,0,0,0,0,0,0,0,0,0,0,0,0,0,0,0,0,0,0,0,0,0,0,null,1,0,0,"","p","p",0]
["",0,0,0,0,null,null,null,null,null,"",{"$error":"#VALUE!"},"",{"$error":"#VALUE!"},"",{"$error":"#VALUE!"},"","","",{"$f":"IF(V393>0,COUNTIF(Q$7:Q393,\"=\"&Q393)-1,\"\")","v":""},"",0,0,0,0,0,0,0,0,0,0,0,0,0,0,0,0,0,0,0,0,0,0,0,0,0,0,0,0,0,0,0,0,0,0,0,0,0,0,0,0,0,0,0,0,0,0,0,0,0,0,0,0,0,0,0,0,0,0,0,0,0,0,0,0,0,0,0,0,0,0,0,0,0,0,0,0,0,0,0,null,1,0,0,"","p","p",0]
["",0,0,0,0,null,null,null,null,null,"",{"$error":"#VALUE!"},"",{"$error":"#VALUE!"},"",{"$error":"#VALUE!"},"","","",{"$f":"IF(V394>0,COUNTIF(Q$7:Q394,\"=\"&Q394)-1,\"\")","v":""},"",0,0,0,0,0,0,0,0,0,0,0,0,0,0,0,0,0,0,0,0,0,0,0,0,0,0,0,0,0,0,0,0,0,0,0,0,0,0,0,0,0,0,0,0,0,0,0,0,0,0,0,0,0,0,0,0,0,0,0,0,0,0,0,0,0,0,0,0,0,0,0,0,0,0,0,0,0,0,0,null,1,0,0,"","p","p",0]
["",0,0,0,0,null,null,null,null,null,"",{"$error":"#VALUE!"},"",{"$error":"#VALUE!"},"",{"$error":"#VALUE!"},"","","",{"$f":"IF(V395>0,COUNTIF(Q$7:Q395,\"=\"&Q395)-1,\"\")","v":""},"",0,0,0,0,0,0,0,0,0,0,0,0,0,0,0,0,0,0,0,0,0,0,0,0,0,0,0,0,0,0,0,0,0,0,0,0,0,0,0,0,0,0,0,0,0,0,0,0,0,0,0,0,0,0,0,0,0,0,0,0,0,0,0,0,0,0,0,0,0,0,0,0,0,0,0,0,0,0,0,null,1,0,0,"","p","p",0]
["",0,0,0,0,null,null,null,null,null,"",{"$error":"#VALUE!"},"",{"$error":"#VALUE!"},"",{"$error":"#VALUE!"},"","","",{"$f":"IF(V396>0,COUNTIF(Q$7:Q396,\"=\"&Q396)-1,\"\")","v":""},"",0,0,0,0,0,0,0,0,0,0,0,0,0,0,0,0,0,0,0,0,0,0,0,0,0,0,0,0,0,0,0,0,0,0,0,0,0,0,0,0,0,0,0,0,0,0,0,0,0,0,0,0,0,0,0,0,0,0,0,0,0,0,0,0,0,0,0,0,0,0,0,0,0,0,0,0,0,0,0,null,1,0,0,"","p","p",0]
["",0,0,0,0,null,null,null,null,null,"",{"$error":"#VALUE!"},"",{"$error":"#VALUE!"},"",{"$error":"#VALUE!"},"","","",{"$f":"IF(V397>0,COUNTIF(Q$7:Q397,\"=\"&Q397)-1,\"\")","v":""},"",0,0,0,0,0,0,{"$f":"IF($CZ397>0,$V397-LEN(SUBSTITUTE($J397,AB$4,\"\")),0)","v":0},0,0,0,0,0,0,0,0,0,{"$f":"IF($CZ397>0,$V397-LEN(SUBSTITUTE($J397,AL$4,\"\")),0)","v":0},0,0,0,0,0,0,0,0,0,{"$f":"IF($CZ397>0,$V397-LEN(SUBSTITUTE($J397,AV$4,\"\")),0)","v":0},0,0,0,0,0,0,0,0,0,0,0,0,{"$f":"IF($CZ397>0,$V397-LEN(SUBSTITUTE($J397,BI$4,\"\")),0)","v":0},0,0,0,0,0,0,0,0,0,{"$f":"IF($CZ397>0,$V397-LEN(SUBSTITUTE($J397,BS$4,\"\")),0)","v":0},0,0,0,0,0,0,0,0,0,{"$f":"IF($CZ397>0,$V397-LEN(SUBSTITUTE($J397,CC$4,\"\")),0)","v":0},0,0,0,0,0,0,0,0,0,0,0,0,0,0,0,0,0,0,0,null,1,0,0,"","p","p",0]
["",0,0,0,0,null,null,null,null,null,"",{"$error":"#VALUE!"},"",{"$error":"#VALUE!"},"",{"$error":"#VALUE!"},"","","",{"$f":"IF(V398>0,COUNTIF(Q$7:Q398,\"=\"&Q398)-1,\"\")","v":""},"",0,0,0,0,0,0,0,0,0,0,0,0,0,0,0,0,0,0,0,0,0,0,0,0,0,0,0,0,0,0,0,0,0,0,0,0,0,0,0,0,0,0,0,0,0,0,0,0,0,0,0,0,0,0,0,0,0,0,0,0,0,0,0,0,0,0,0,0,0,0,0,0,0,0,0,0,0,0,0,null,1,0,0,"","p","p",0]
["",0,0,0,0,null,null,null,null,null,"",{"$error":"#VALUE!"},"",{"$error":"#VALUE!"},"",{"$error":"#VALUE!"},"","","",{"$f":"IF(V399>0,COUNTIF(Q$7:Q399,\"=\"&Q399)-1,\"\")","v":""},"",0,0,0,0,0,0,0,0,0,0,0,0,0,0,0,0,0,0,0,0,0,0,0,0,0,0,0,0,0,0,0,0,0,0,0,0,0,0,0,0,0,0,0,0,0,0,0,0,0,0,0,0,0,0,0,0,0,0,0,0,0,0,0,0,0,0,0,0,0,0,0,0,0,0,0,0,0,0,0,null,1,0,0,"","p","p",0]
["",0,0,0,0,null,null,null,null,null,"",{"$error":"#VALUE!"},"",{"$error":"#VALUE!"},"",{"$error":"#VALUE!"},"","","",{"$f":"IF(V400>0,COUNTIF(Q$7:Q400,\"=\"&Q400)-1,\"\")","v":""},"",0,0,0,0,0,0,0,0,0,0,0,0,0,0,0,0,0,0,0,0,0,0,0,0,0,0,0,0,0,0,0,0,0,0,0,0,0,0,0,0,0,0,0,0,0,0,0,0,0,0,0,0,0,0,0,0,0,0,0,0,0,0,0,0,0,0,0,0,0,0,0,0,0,0,0,0,0,0,0,null,1,0,0,"","p","p",0]
["",0,0,0,0,null,null,null,null,null,"",{"$error":"#VALUE!"},"",{"$error":"#VALUE!"},"",{"$error":"#VALUE!"},"","","",{"$f":"IF(V401>0,COUNTIF(Q$7:Q401,\"=\"&Q401)-1,\"\")","v":""},"",0,0,0,0,0,0,0,0,0,0,0,0,0,0,0,0,0,0,0,0,0,0,0,0,0,0,0,0,0,0,0,0,0,0,0,0,0,0,0,0,0,0,0,0,0,0,0,0,0,0,0,0,0,0,0,0,0,0,0,0,0,0,0,0,0,0,0,0,0,0,0,0,0,0,0,0,0,0,0,null,1,0,0,"","p","p",0]
["",0,0,0,0,null,null,null,null,null,"",{"$error":"#VALUE!"},"",{"$error":"#VALUE!"},"",{"$error":"#VALUE!"},"","","",{"$f":"IF(V402>0,COUNTIF(Q$7:Q402,\"=\"&Q402)-1,\"\")","v":""},"",0,0,0,0,0,0,0,0,0,0,0,0,0,0,0,0,0,0,0,0,0,0,0,0,0,0,0,0,0,0,0,0,0,0,0,0,0,0,0,0,0,0,0,0,0,0,0,0,0,0,0,0,0,0,0,0,0,0,0,0,0,0,0,0,0,0,0,0,0,0,0,0,0,0,0,0,0,0,0,null,1,0,0,"","p","p",0]
["",0,0,0,0,null,null,null,null,null,"",{"$error":"#VALUE!"},"",{"$error":"#VALUE!"},"",{"$error":"#VALUE!"},"","","",{"$f":"IF(V403>0,COUNTIF(Q$7:Q403,\"=\"&Q403)-1,\"\")","v":""},"",0,0,0,0,0,0,0,0,0,0,0,0,0,0,0,0,0,0,0,0,0,0,0,0,0,0,0,0,0,0,0,0,0,0,0,0,0,0,0,0,0,0,0,0,0,0,0,0,0,0,0,0,0,0,0,0,0,0,0,0,0,0,0,0,0,0,0,0,0,0,0,0,0,0,0,0,0,0,0,null,1,0,0,"","p","p",0]
["",0,0,0,0,null,null,null,null,null,"",{"$error":"#VALUE!"},"",{"$error":"#VALUE!"},"",{"$error":"#VALUE!"},"","","",{"$f":"IF(V404>0,COUNTIF(Q$7:Q404,\"=\"&Q404)-1,\"\")","v":""},"",0,0,0,0,0,0,0,0,0,0,0,0,0,0,0,0,0,0,0,0,0,0,0,0,0,0,0,0,0,0,0,0,0,0,0,0,0,0,0,0,0,0,0,0,0,0,0,0,0,0,0,0,0,0,0,0,0,0,0,0,0,0,0,0,0,0,0,0,0,0,0,0,0,0,0,0,0,0,0,null,1,0,0,"","p","p",0]
["",0,0,0,0,null,null,null,null,null,"",{"$error":"#VALUE!"},"",{"$error":"#VALUE!"},"",{"$error":"#VALUE!"},"","","",{"$f":"IF(V405>0,COUNTIF(Q$7:Q405,\"=\"&Q405)-1,\"\")","v":""},"",0,0,0,0,0,0,0,0,0,0,0,0,0,0,0,0,0,0,0,0,0,0,0,0,0,0,0,0,0,0,0,0,0,0,0,0,0,0,0,0,0,0,0,0,0,0,0,0,0,0,0,0,0,0,0,0,0,0,0,0,0,0,0,0,0,0,0,0,0,0,0,0,0,0,0,0,0,0,0,null,1,0,0,"","p","p",0]
["",0,0,0,0,null,null,null,null,null,"",{"$error":"#VALUE!"},"",{"$error":"#VALUE!"},"",{"$error":"#VALUE!"},"","","",{"$f":"IF(V406>0,COUNTIF(Q$7:Q406,\"=\"&Q406)-1,\"\")","v":""},"",0,0,0,0,0,0,0,0,0,0,0,0,0,0,0,0,0,0,0,0,0,0,0,0,0,0,0,0,0,0,0,0,0,0,0,0,0,0,0,0,0,0,0,0,0,0,0,0,0,0,0,0,0,0,0,0,0,0,0,0,0,0,0,0,0,0,0,0,0,0,0,0,0,0,0,0,0,0,0,null,1,0,0,"","p","p",0]
["",0,0,0,0,null,null,null,null,null,"",{"$error":"#VALUE!"},"",{"$error":"#VALUE!"},"",{"$error":"#VALUE!"},"","","",{"$f":"IF(V407>0,COUNTIF(Q$7:Q407,\"=\"&Q407)-1,\"\")","v":""},"",0,0,0,0,0,0,{"$f":"IF($CZ407>0,$V407-LEN(SUBSTITUTE($J407,AB$4,\"\")),0)","v":0},0,0,0,0,0,0,0,0,0,{"$f":"IF($CZ407>0,$V407-LEN(SUBSTITUTE($J407,AL$4,\"\")),0)","v":0},0,0,0,0,0,0,0,0,0,{"$f":"IF($CZ407>0,$V407-LEN(SUBSTITUTE($J407,AV$4,\"\")),0)","v":0},0,0,0,0,0,0,0,0,0,0,0,0,{"$f":"IF($CZ407>0,$V407-LEN(SUBSTITUTE($J407,BI$4,\"\")),0)","v":0},0,0,0,0,0,0,0,0,0,{"$f":"IF($CZ407>0,$V407-LEN(SUBSTITUTE($J407,BS$4,\"\")),0)","v":0},0,0,0,0,0,0,0,0,0,{"$f":"IF($CZ407>0,$V407-LEN(SUBSTITUTE($J407,CC$4,\"\")),0)","v":0},0,0,0,0,0,0,0,0,0,0,{"$f":"IF($CZ407>0,$V407-LEN(SUBSTITUTE($J407,CN$4,\"\")),0)","v":0},0,0,0,{"$f":"IF($CZ407>0,$V407-LEN(SUBSTITUTE($J407,CR$4,\"\")),0)","v":0},0,0,0,0,null,1,0,0,"","p","p",0]
["",0,0,0,0,null,null,null,null,null,"",{"$error":"#VALUE!"},"",{"$error":"#VALUE!"},"",{"$error":"#VALUE!"},"","","",{"$f":"IF(V408>0,COUNTIF(Q$7:Q408,\"=\"&Q408)-1,\"\")","v":""},"",0,0,0,0,0,0,0,0,0,0,0,0,0,0,0,0,0,0,0,0,0,0,0,0,0,0,0,0,0,0,0,0,0,0,0,0,0,0,0,0,0,0,0,0,0,0,0,0,0,0,0,0,0,0,0,0,0,0,0,0,0,0,0,0,0,0,0,0,0,0,0,0,0,0,0,0,0,0,0,null,1,0,0,"","p","p",0]
["",0,0,0,0,null,null,null,null,null,"",{"$error":"#VALUE!"},"",{"$error":"#VALUE!"},"",{"$error":"#VALUE!"},"","","",{"$f":"IF(V409>0,COUNTIF(Q$7:Q409,\"=\"&Q409)-1,\"\")","v":""},"",0,0,0,0,0,0,0,0,0,0,0,0,0,0,0,0,0,0,0,0,0,0,0,0,0,0,0,0,0,0,0,0,0,0,0,0,0,0,0,0,0,0,0,0,0,0,0,0,0,0,0,0,0,0,0,0,0,0,0,0,0,0,0,0,0,0,0,0,0,0,0,0,0,0,0,0,0,0,0,null,1,0,0,"","p","p",0]
["",0,0,0,0,null,null,null,null,null,"",{"$error":"#VALUE!"},"",{"$error":"#VALUE!"},"",{"$error":"#VALUE!"},"","","",{"$f":"IF(V410>0,COUNTIF(Q$7:Q410,\"=\"&Q410)-1,\"\")","v":""},"",0,0,0,0,0,0,0,0,0,0,0,0,0,0,0,0,0,0,0,0,0,0,0,0,0,0,0,0,0,0,0,0,0,0,0,0,0,0,0,0,0,0,0,0,0,0,0,0,0,0,0,0,0,0,0,0,0,0,0,0,0,0,0,0,0,0,0,0,0,0,0,0,0,0,0,0,0,0,0,null,1,0,0,"","p","p",0]
["",0,0,0,0,null,null,null,null,null,"",{"$error":"#VALUE!"},"",{"$error":"#VALUE!"},"",{"$error":"#VALUE!"},"","","",{"$f":"IF(V411>0,COUNTIF(Q$7:Q411,\"=\"&Q411)-1,\"\")","v":""},"",0,0,0,0,0,0,0,0,0,0,0,0,0,0,0,0,0,0,0,0,0,0,0,0,0,0,0,0,0,0,0,0,0,0,0,0,0,0,0,0,0,0,0,0,0,0,0,0,0,0,0,0,0,0,0,0,0,0,0,0,0,0,0,0,0,0,0,0,0,0,0,0,0,0,0,0,0,0,0,null,1,0,0,"","p","p",0]
["",0,0,0,0,null,null,null,null,null,"",{"$error":"#VALUE!"},"",{"$error":"#VALUE!"},"",{"$error":"#VALUE!"},"","","",{"$f":"IF(V412>0,COUNTIF(Q$7:Q412,\"=\"&Q412)-1,\"\")","v":""},"",0,0,0,0,0,0,0,0,0,0,0,0,0,0,0,0,0,0,0,0,0,0,0,0,0,0,0,0,0,0,0,0,0,0,0,0,0,0,0,0,0,0,0,0,0,0,0,0,0,0,0,0,0,0,0,0,0,0,0,0,0,0,0,0,0,0,0,0,0,0,0,0,0,0,0,0,0,0,0,null,1,0,0,"","p","p",0]
["",0,0,0,0,null,null,null,null,null,"",{"$error":"#VALUE!"},"",{"$error":"#VALUE!"},"",{"$error":"#VALUE!"},"","","",{"$f":"IF(V413>0,COUNTIF(Q$7:Q413,\"=\"&Q413)-1,\"\")","v":""},"",0,0,0,0,0,0,0,0,0,0,0,0,0,0,0,0,0,0,0,0,0,0,0,0,0,0,0,0,0,0,0,0,0,0,0,0,0,0,0,0,0,0,0,0,0,0,0,0,0,0,0,0,0,0,0,0,0,0,0,0,0,0,0,0,0,0,0,0,0,0,0,0,0,0,0,0,0,0,0,null,1,0,0,"","p","p",0]
["",0,0,0,0,null,null,null,null,null,"",{"$error":"#VALUE!"},"",{"$error":"#VALUE!"},"",{"$error":"#VALUE!"},"","","",{"$f":"IF(V414>0,COUNTIF(Q$7:Q414,\"=\"&Q414)-1,\"\")","v":""},"",0,0,0,0,0,0,0,0,0,0,0,0,0,0,0,0,0,0,0,0,0,0,0,0,0,0,0,0,0,0,0,0,0,0,0,0,0,0,0,0,0,0,0,0,0,0,0,0,0,0,0,0,0,0,0,0,0,0,0,0,0,0,0,0,0,0,0,0,0,0,0,0,0,0,0,0,0,0,0,null,1,0,0,"","p","p",0]
["",0,0,0,0,null,null,null,null,null,"",{"$error":"#VALUE!"},"",{"$error":"#VALUE!"},"",{"$error":"#VALUE!"},"","","",{"$f":"IF(V415>0,COUNTIF(Q$7:Q415,\"=\"&Q415)-1,\"\")","v":""},"",0,0,0,0,0,0,0,0,0,0,0,0,0,0,0,0,0,0,0,0,0,0,0,0,0,0,0,0,0,0,0,0,0,0,0,0,0,0,0,0,0,0,0,0,0,0,0,0,0,0,0,0,0,0,0,0,0,0,0,0,0,0,0,0,0,0,0,0,0,0,0,0,0,0,0,0,0,0,0,null,1,0,0,"","p","p",0]
["",0,0,0,0,null,null,null,null,null,"",{"$error":"#VALUE!"},"",{"$error":"#VALUE!"},"",{"$error":"#VALUE!"},"","","",{"$f":"IF(V416>0,COUNTIF(Q$7:Q416,\"=\"&Q416)-1,\"\")","v":""},"",0,0,0,0,0,0,0,0,0,0,0,0,0,0,0,0,0,0,0,0,0,0,0,0,0,0,0,0,0,0,0,0,0,0,0,0,0,0,0,0,0,0,0,0,0,0,0,0,0,0,0,0,0,0,0,0,0,0,0,0,0,0,0,0,0,0,0,0,0,0,0,0,0,0,0,0,0,0,0,null,1,0,0,"","p","p",0]
["",0,0,0,0,null,null,null,null,null,"",{"$error":"#VALUE!"},"",{"$error":"#VALUE!"},"",{"$error":"#VALUE!"},"","","",{"$f":"IF(V417>0,COUNTIF(Q$7:Q417,\"=\"&Q417)-1,\"\")","v":""},"",0,0,0,0,0,0,{"$f":"IF($CZ417>0,$V417-LEN(SUBSTITUTE($J417,AB$4,\"\")),0)","v":0},0,0,0,0,0,0,0,0,0,{"$f":"IF($CZ417>0,$V417-LEN(SUBSTITUTE($J417,AL$4,\"\")),0)","v":0},0,0,0,0,0,0,0,0,0,{"$f":"IF($CZ417>0,$V417-LEN(SUBSTITUTE($J417,AV$4,\"\")),0)","v":0},0,0,0,0,0,0,0,0,0,0,0,0,{"$f":"IF($CZ417>0,$V417-LEN(SUBSTITUTE($J417,BI$4,\"\")),0)","v":0},0,0,0,0,0,0,0,0,0,{"$f":"IF($CZ417>0,$V417-LEN(SUBSTITUTE($J417,BS$4,\"\")),0)","v":0},0,0,0,0,0,0,0,0,0,{"$f":"IF($CZ417>0,$V417-LEN(SUBSTITUTE($J417,CC$4,\"\")),0)","v":0},0,0,0,0,0,0,0,0,0,0,0,0,0,0,0,0,0,0,0,null,1,0,0,"","p","p",0]
["",0,0,0,0,null,null,null,null,null,"",{"$error":"#VALUE!"},"",{"$error":"#VALUE!"},"",{"$error":"#VALUE!"},"","","",{"$f":"IF(V418>0,COUNTIF(Q$7:Q418,\"=\"&Q418)-1,\"\")","v":""},"",0,0,0,0,0,0,0,0,0,0,0,0,0,0,0,0,0,0,0,0,0,0,0,0,0,0,0,0,0,0,0,0,0,0,0,0,0,0,0,0,0,0,0,0,0,0,0,0,0,0,0,0,0,0,0,0,0,0,0,0,0,0,0,0,0,0,0,0,0,0,0,0,0,0,0,0,0,0,0,null,1,0,0,"","p","p",0]
["",0,0,0,0,null,null,null,null,null,"",{"$error":"#VALUE!"},"",{"$error":"#VALUE!"},"",{"$error":"#VALUE!"},"","","",{"$f":"IF(V419>0,COUNTIF(Q$7:Q419,\"=\"&Q419)-1,\"\")","v":""},"",0,0,0,0,0,0,0,0,0,0,0,0,0,0,0,0,0,0,0,0,0,0,0,0,0,0,0,0,0,0,0,0,0,0,0,0,0,0,0,0,0,0,0,0,0,0,0,0,0,0,0,0,0,0,0,0,0,0,0,0,0,0,0,0,0,0,0,0,0,0,0,0,0,0,0,0,0,0,0,null,1,0,0,"","p","p",0]
["",0,0,0,0,null,null,null,null,null,"",{"$error":"#VALUE!"},"",{"$error":"#VALUE!"},"",{"$error":"#VALUE!"},"","","",{"$f":"IF(V420>0,COUNTIF(Q$7:Q420,\"=\"&Q420)-1,\"\")","v":""},"",0,{"$f":"$V420-LEN(SUBSTITUTE($J420,W$4,\"\"))","v":0},0,0,0,0,0,0,0,0,0,0,0,0,0,0,0,0,0,0,0,0,0,0,0,0,0,0,0,0,0,0,0,0,0,0,0,0,0,0,0,0,0,0,0,0,0,0,0,0,0,0,0,0,0,0,0,0,0,0,0,0,0,0,0,0,0,0,0,0,0,0,0,0,0,0,0,0,0,null,1,0,0,"","p","p",0]
["",0,0,0,0,null,null,null,null,null,"",{"$error":"#VALUE!"},"",{"$error":"#VALUE!"},"",{"$error":"#VALUE!"},"","","",{"$f":"IF(V421>0,COUNTIF(Q$7:Q421,\"=\"&Q421)-1,\"\")","v":""},"",0,0,0,0,0,0,0,0,0,0,0,0,0,0,0,0,0,0,0,0,0,0,0,0,0,0,0,0,0,0,0,0,0,0,0,0,0,0,0,0,0,0,0,0,0,0,0,0,0,0,0,0,0,0,0,0,0,0,0,0,0,0,0,0,0,0,0,0,0,0,0,0,0,0,0,0,0,0,0,null,1,0,0,"","p","p",0]
["",0,0,0,0,null,null,null,null,null,"",{"$error":"#VALUE!"},"",{"$error":"#VALUE!"},"",{"$error":"#VALUE!"},"","","",{"$f":"IF(V422>0,COUNTIF(Q$7:Q422,\"=\"&Q422)-1,\"\")","v":""},"",0,0,0,0,0,0,0,0,0,0,0,0,0,0,0,0,0,0,0,0,0,0,0,0,0,0,0,0,0,0,0,0,0,0,0,0,0,0,0,0,0,0,0,0,0,0,0,0,0,0,0,0,0,0,0,0,0,0,0,0,0,0,0,0,0,0,0,0,0,0,0,0,0,0,0,0,0,0,0,null,1,0,0,"","p","p",0]
["",0,0,0,0,null,null,null,null,null,"",{"$error":"#VALUE!"},"",{"$error":"#VALUE!"},"",{"$error":"#VALUE!"},"","","",{"$f":"IF(V423>0,COUNTIF(Q$7:Q423,\"=\"&Q423)-1,\"\")","v":""},"",0,0,0,0,0,0,0,0,0,0,0,0,0,0,0,0,0,0,0,0,0,0,0,0,0,0,0,0,0,0,0,0,0,0,0,0,0,0,0,0,0,0,0,0,0,0,0,0,0,0,0,0,0,0,0,0,0,0,0,0,0,0,0,0,0,0,0,0,0,0,0,0,0,0,{"$f":"IF($CZ423>0,$V423-LEN(SUBSTITUTE($J423,CR$4,\"\")),0)","v":0},0,0,0,0,null,1,0,0,"","p","p",0]
[{"$f":"IF(V424=0,\"\",A423+1)","v":""},0,0,0,0,null,null,null,null,null,{"$f":"IF(V424=0,\"\",SUMPRODUCT(W$5:CY$5,W424:CY424))","v":""},{"$f":"IF(C424=-1,\"\",K424-18.01528)","v":{"$error":"#VALUE!"}},{"$f":"IF(V424=0,\"\",SUMPRODUCT(W$6:CY$6,W424:CY424))","v":""},{"$f":"IF(C424=-1,\"\",M424-18.0105646861)","v":{"$error":"#VALUE!"}},{"$f":"IF(V424=0,\"\",M424+TRUNC(K424-M424-0.1))","v":""},{"$f":"IF(C424=-1,\"\",O424-18.0105646861)","v":{"$error":"#VALUE!"}},{"$f":"IF(V424>0,ROUND(K424,4),\"\")","v":""},{"$f":"IF(V424>0,S424+T424,\"\")","v":""},"",{"$f":"IF(V424>0,COUNTIF(Q$7:Q424,\"=\"&Q424)-1,\"\")","v":""},{"$f":"IF(V424>0,$R$6-R424+1,\"\")","v":""},{"$f":"LEN(J424)","v":0},0,0,0,0,0,0,0,0,0,0,0,0,0,0,0,0,0,0,0,0,0,0,0,0,0,0,0,0,0,0,0,0,0,0,0,0,0,{"$f":"IF($CZ424>0,$V424-LEN(SUBSTITUTE($J424,BH$4,\"\")),0)+DD424","v":0},0,0,0,0,0,0,0,0,0,0,0,0,0,0,0,0,0,0,0,0,0,0,0,0,0,0,0,0,0,0,0,0,0,0,0,0,0,0,0,{"$f":"V424+B424+C424","v":0},null,{"$f":"-(V424-1)+D424","v":1},{"$f":"E424","v":0},0,{"$f":"IF($B424=0,\"\",IF(F424=1,LEFT($B$2,LEN($B$2)-1),LEFT($B$3,LEN($B$3)-1)))","v":""},"p",{"$f":"DA424&J424&DB424","v":"p"},0]
["",0,0,0,0,null,null,null,null,null,"",{"$error":"#VALUE!"},"",{"$error":"#VALUE!"},"",{"$error":"#VALUE!"},"","","",{"$f":"IF(V425>0,COUNTIF(Q$7:Q425,\"=\"&Q425)-1,\"\")","v":""},"",0,0,0,0,0,0,0,0,0,0,0,0,0,0,0,0,0,0,0,0,0,0,0,0,0,0,0,0,0,0,0,0,0,0,0,0,0,0,0,0,0,0,0,0,0,0,0,0,0,0,0,0,0,0,0,0,0,0,0,0,0,0,0,0,0,0,0,0,0,0,0,0,0,0,0,0,0,0,0,null,1,0,0,"","p","p",0]
["",0,0,0,0,null,null,null,null,null,"",{"$error":"#VALUE!"},"",{"$error":"#VALUE!"},"",{"$error":"#VALUE!"},"","","",{"$f":"IF(V426>0,COUNTIF(Q$7:Q426,\"=\"&Q426)-1,\"\")","v":""},"",0,0,0,0,0,0,0,0,0,0,0,0,0,0,0,0,0,0,0,0,0,0,0,0,0,0,0,0,0,0,0,0,0,0,0,0,0,0,0,0,0,0,0,0,0,0,0,0,0,0,0,0,0,0,0,0,0,0,0,0,0,0,0,0,0,0,0,0,0,0,0,0,0,0,0,0,0,0,0,null,1,0,0,"","p","p",0]
["",0,0,0,0,null,null,null,null,null,"",{"$error":"#VALUE!"},"",{"$error":"#VALUE!"},"",{"$error":"#VALUE!"},"","","",{"$f":"IF(V427>0,COUNTIF(Q$7:Q427,\"=\"&Q427)-1,\"\")","v":""},"",0,0,0,0,0,0,{"$f":"IF($CZ427>0,$V427-LEN(SUBSTITUTE($J427,AB$4,\"\")),0)","v":0},0,0,0,0,0,0,0,0,0,{"$f":"IF($CZ427>0,$V427-LEN(SUBSTITUTE($J427,AL$4,\"\")),0)","v":0},0,0,0,0,0,0,0,0,0,{"$f":"IF($CZ427>0,$V427-LEN(SUBSTITUTE($J427,AV$4,\"\")),0)","v":0},0,0,0,0,0,0,0,0,0,0,0,0,{"$f":"IF($CZ427>0,$V427-LEN(SUBSTITUTE($J427,BI$4,\"\")),0)","v":0},0,0,0,0,0,0,0,0,0,{"$f":"IF($CZ427>0,$V427-LEN(SUBSTITUTE($J427,BS$4,\"\")),0)","v":0},0,0,0,0,0,0,0,0,0,{"$f":"IF($CZ427>0,$V427-LEN(SUBSTITUTE($J427,CC$4,\"\")),0)","v":0},0,0,0,0,0,0,0,0,0,0,{"$f":"IF($CZ427>0,$V427-LEN(SUBSTITUTE($J427,CN$4,\"\")),0)","v":0},0,0,0,0,0,0,0,0,null,1,0,0,"","p","p",0]
["",0,0,0,0,null,null,null,null,null,"",{"$error":"#VALUE!"},"",{"$error":"#VALUE!"},"",{"$error":"#VALUE!"},"","","",{"$f":"IF(V428>0,COUNTIF(Q$7:Q428,\"=\"&Q428)-1,\"\")","v":""},"",0,0,0,0,0,0,0,0,0,0,0,0,0,0,0,0,0,0,0,0,0,0,0,0,0,0,0,0,0,0,0,0,0,0,0,0,0,0,0,0,0,0,0,0,0,0,0,0,0,0,0,0,0,0,0,0,0,0,0,0,0,0,0,0,0,0,0,0,0,0,0,0,0,0,0,0,0,0,0,null,1,0,0,"","p","p",0]
["",0,0,0,0,null,null,null,null,null,"",{"$error":"#VALUE!"},"",{"$error":"#VALUE!"},"",{"$error":"#VALUE!"},"","","",{"$f":"IF(V429>0,COUNTIF(Q$7:Q429,\"=\"&Q429)-1,\"\")","v":""},"",0,0,0,0,0,0,0,0,0,0,0,0,0,0,0,0,0,0,0,0,0,0,0,0,0,0,0,0,0,0,0,0,0,0,0,0,0,0,0,0,0,0,0,0,0,0,0,0,0,0,0,0,0,0,0,0,0,0,0,0,0,0,0,0,0,0,0,0,0,0,0,0,0,0,0,0,0,0,0,null,1,0,0,"","p","p",0]
["",0,0,0,0,null,null,null,null,null,"",{"$error":"#VALUE!"},"",{"$error":"#VALUE!"},"",{"$error":"#VALUE!"},"","","",{"$f":"IF(V430>0,COUNTIF(Q$7:Q430,\"=\"&Q430)-1,\"\")","v":""},"",0,0,0,0,0,0,0,0,0,0,0,0,0,0,0,0,0,0,0,0,0,0,0,0,0,0,0,0,0,0,0,0,0,0,0,0,0,0,0,0,0,0,0,0,0,0,0,0,0,0,0,0,0,0,0,0,0,0,0,0,0,0,0,0,0,0,0,0,0,0,0,0,0,0,0,0,0,0,0,null,1,0,0,"","p","p",0]
["",0,0,0,0,null,null,null,null,null,"",{"$error":"#VALUE!"},"",{"$error":"#VALUE!"},"",{"$error":"#VALUE!"},"","","",{"$f":"IF(V431>0,COUNTIF(Q$7:Q431,\"=\"&Q431)-1,\"\")","v":""},"",0,0,0,0,0,0,0,0,0,0,0,0,0,0,0,0,0,0,0,0,0,0,0,0,0,0,0,0,0,0,0,0,0,0,0,0,0,0,0,0,0,0,0,0,0,0,0,0,0,0,0,0,0,0,0,0,0,0,0,0,0,0,0,0,0,0,0,0,0,0,0,0,0,0,0,0,0,0,0,null,1,0,0,"","p","p",0]
["",0,0,0,0,null,null,null,null,null,"",{"$error":"#VALUE!"},"",{"$error":"#VALUE!"},"",{"$error":"#VALUE!"},"","","",{"$f":"IF(V432>0,COUNTIF(Q$7:Q432,\"=\"&Q432)-1,\"\")","v":""},"",0,0,0,0,0,0,0,0,0,0,0,0,0,0,0,0,0,0,0,0,0,0,0,0,0,0,0,0,0,0,0,0,0,0,0,0,0,0,0,0,0,0,0,0,0,0,0,0,0,0,0,0,0,0,0,0,0,0,0,0,0,0,0,0,0,0,0,0,0,0,0,0,0,0,0,0,0,0,0,null,1,0,0,"","p","p",0]
["",0,0,0,0,null,null,null,null,null,"",{"$error":"#VALUE!"},"",{"$error":"#VALUE!"},"",{"$error":"#VALUE!"},"","","",{"$f":"IF(V433>0,COUNTIF(Q$7:Q433,\"=\"&Q433)-1,\"\")","v":""},"",0,0,0,0,0,0,0,0,0,0,0,0,0,0,0,0,0,0,0,0,0,0,0,0,0,0,0,0,0,0,0,0,0,0,0,0,0,0,0,0,0,0,0,0,0,0,0,0,0,0,0,0,0,0,0,0,0,0,0,0,0,0,0,0,0,0,0,0,0,0,0,0,0,0,0,0,0,0,0,null,1,0,0,"","p","p",0]
["",0,0,0,0,null,null,null,null,null,"",{"$error":"#VALUE!"},"",{"$error":"#VALUE!"},"",{"$error":"#VALUE!"},"","","",{"$f":"IF(V434>0,COUNTIF(Q$7:Q434,\"=\"&Q434)-1,\"\")","v":""},"",0,0,0,0,0,0,0,0,0,0,0,0,0,0,0,0,0,0,0,0,0,0,0,0,0,0,0,0,0,0,0,0,0,0,0,0,0,0,0,0,0,0,0,0,0,0,0,0,0,0,0,0,0,0,0,0,0,0,0,0,0,0,0,0,0,0,0,0,0,0,0,0,0,0,0,0,0,0,0,null,1,0,0,"","p","p",0]
["",0,0,0,0,null,null,null,null,null,"",{"$error":"#VALUE!"},"",{"$error":"#VALUE!"},"",{"$error":"#VALUE!"},"","","",{"$f":"IF(V435>0,COUNTIF(Q$7:Q435,\"=\"&Q435)-1,\"\")","v":""},"",0,0,0,0,0,0,0,0,0,0,0,0,0,0,0,0,0,0,0,0,0,0,0,0,0,0,0,0,0,0,0,0,0,0,0,0,0,0,0,0,0,0,0,0,0,0,0,0,0,0,0,0,0,0,0,0,0,0,0,0,0,0,0,0,0,0,0,0,0,0,0,0,0,0,0,0,0,0,0,null,1,0,0,"","p","p",0]
["",0,0,0,0,null,null,null,null,null,"",{"$error":"#VALUE!"},"",{"$error":"#VALUE!"},"",{"$error":"#VALUE!"},"","","",{"$f":"IF(V436>0,COUNTIF(Q$7:Q436,\"=\"&Q436)-1,\"\")","v":""},"",0,0,0,0,0,0,0,0,0,0,0,0,0,0,0,0,0,0,0,0,0,0,0,0,0,0,0,0,0,0,0,0,0,0,0,0,0,0,0,0,0,0,0,0,0,0,0,0,0,0,0,0,0,0,0,0,0,0,0,0,0,0,0,0,0,0,0,0,0,0,0,0,0,0,0,0,0,0,0,null,1,0,0,"","p","p",0]
["",0,0,0,0,null,null,null,null,null,"",{"$error":"#VALUE!"},"",{"$error":"#VALUE!"},"",{"$error":"#VALUE!"},"","","",{"$f":"IF(V437>0,COUNTIF(Q$7:Q437,\"=\"&Q437)-1,\"\")","v":""},"",0,0,0,0,0,0,{"$f":"IF($CZ437>0,$V437-LEN(SUBSTITUTE($J437,AB$4,\"\")),0)","v":0},0,0,0,0,0,0,0,0,0,{"$f":"IF($CZ437>0,$V437-LEN(SUBSTITUTE($J437,AL$4,\"\")),0)","v":0},0,0,0,0,0,0,0,0,0,{"$f":"IF($CZ437>0,$V437-LEN(SUBSTITUTE($J437,AV$4,\"\")),0)","v":0},0,0,0,0,0,0,0,0,0,0,0,0,{"$f":"IF($CZ437>0,$V437-LEN(SUBSTITUTE($J437,BI$4,\"\")),0)","v":0},0,0,0,0,0,0,0,0,0,{"$f":"IF($CZ437>0,$V437-LEN(SUBSTITUTE($J437,BS$4,\"\")),0)","v":0},0,0,0,0,0,0,0,0,0,{"$f":"IF($CZ437>0,$V437-LEN(SUBSTITUTE($J437,CC$4,\"\")),0)","v":0},0,0,0,0,0,0,0,0,0,0,0,0,0,0,0,0,0,0,0,null,1,0,0,"","p","p",0]
["",0,0,0,0,null,null,null,null,null,"",{"$error":"#VALUE!"},"",{"$error":"#VALUE!"},"",{"$error":"#VALUE!"},"","","",{"$f":"IF(V438>0,COUNTIF(Q$7:Q438,\"=\"&Q438)-1,\"\")","v":""},"",0,0,0,0,0,0,0,0,0,0,0,0,0,0,0,0,0,0,0,0,0,0,0,0,0,0,0,0,0,0,0,0,0,0,0,0,0,0,0,0,0,0,0,0,0,0,0,0,0,0,0,0,0,0,0,0,0,0,0,0,0,0,0,0,0,0,0,0,0,0,0,0,0,0,0,0,0,0,0,null,1,0,0,"","p","p",0]
["",0,0,0,0,null,null,null,null,null,"",{"$error":"#VALUE!"},"",{"$error":"#VALUE!"},"",{"$error":"#VALUE!"},"","","",{"$f":"IF(V439>0,COUNTIF(Q$7:Q439,\"=\"&Q439)-1,\"\")","v":""},"",0,0,0,0,0,0,0,0,0,0,0,0,0,0,0,0,0,0,0,0,0,0,0,0,0,0,0,0,0,0,0,0,0,0,0,0,0,0,0,0,0,0,0,0,0,0,0,0,0,0,0,0,0,0,0,0,0,0,0,0,0,0,0,0,0,0,0,0,0,0,0,0,0,0,{"$f":"IF($CZ439>0,$V439-LEN(SUBSTITUTE($J439,CR$4,\"\")),0)","v":0},0,0,0,0,null,1,0,0,"","p","p",0]
["",0,0,0,0,null,null,null,null,null,"",{"$error":"#VALUE!"},"",{"$error":"#VALUE!"},"",{"$error":"#VALUE!"},"","","",{"$f":"IF(V440>0,COUNTIF(Q$7:Q440,\"=\"&Q440)-1,\"\")","v":""},"",0,0,0,0,0,0,0,0,0,0,0,0,0,0,0,0,0,0,0,0,0,0,0,0,0,0,0,0,0,0,0,0,0,0,0,0,0,0,0,0,0,0,0,0,0,0,0,0,0,0,0,0,0,0,0,0,0,0,0,0,0,0,0,0,0,0,0,0,0,0,0,0,0,0,0,0,0,0,0,null,1,0,0,"","p","p",0]
["",0,0,0,0,null,null,null,null,null,"",{"$error":"#VALUE!"},"",{"$error":"#VALUE!"},"",{"$error":"#VALUE!"},"","","",{"$f":"IF(V441>0,COUNTIF(Q$7:Q441,\"=\"&Q441)-1,\"\")","v":""},"",0,0,0,0,0,0,0,0,0,0,0,0,0,0,0,0,0,0,0,0,0,0,0,0,0,0,0,0,0,0,0,0,0,0,0,0,0,0,0,0,0,0,0,0,0,0,0,0,0,0,0,0,0,0,0,0,0,0,0,0,0,0,0,0,0,0,0,0,0,0,0,0,0,0,0,0,0,0,0,null,1,0,0,"","p","p",0]
["",0,0,0,0,null,null,null,null,null,"",{"$error":"#VALUE!"},"",{"$error":"#VALUE!"},"",{"$error":"#VALUE!"},"","","",{"$f":"IF(V442>0,COUNTIF(Q$7:Q442,\"=\"&Q442)-1,\"\")","v":""},"",0,0,0,0,0,0,0,0,0,0,0,0,0,0,0,0,0,0,0,0,0,0,0,0,0,0,0,0,0,0,0,0,0,0,0,0,0,0,0,0,0,0,0,0,0,0,0,0,0,0,0,0,0,0,0,0,0,0,0,0,0,0,0,0,0,0,0,0,0,0,0,0,0,0,0,0,0,0,0,null,1,0,0,"","p","p",0]
["",0,0,0,0,null,null,null,null,null,"",{"$error":"#VALUE!"},"",{"$error":"#VALUE!"},"",{"$error":"#VALUE!"},"","","",{"$f":"IF(V443>0,COUNTIF(Q$7:Q443,\"=\"&Q443)-1,\"\")","v":""},"",0,0,0,0,0,0,0,0,0,0,0,0,0,0,0,0,0,0,0,0,0,0,0,0,0,0,0,0,0,0,0,0,0,0,0,0,0,0,0,0,0,0,0,0,0,0,0,0,0,0,0,0,0,0,0,0,0,0,0,0,0,0,0,0,0,0,0,0,0,0,0,0,0,0,0,0,0,0,0,null,1,0,0,"","p","p",0]
["",0,0,0,0,null,null,null,null,null,"",{"$error":"#VALUE!"},"",{"$error":"#VALUE!"},"",{"$error":"#VALUE!"},"","","",{"$f":"IF(V444>0,COUNTIF(Q$7:Q444,\"=\"&Q444)-1,\"\")","v":""},"",0,0,0,0,0,0,0,0,0,0,0,0,0,0,0,0,0,0,0,0,0,0,0,0,0,0,0,0,0,0,0,0,0,0,0,0,0,0,0,0,0,0,0,0,0,0,0,0,0,0,0,0,0,0,0,0,0,0,0,0,0,0,0,0,0,0,0,0,0,0,0,0,0,0,0,0,0,0,0,null,1,0,0,"","p","p",0]
["",0,0,0,0,null,null,null,null,null,"",{"$error":"#VALUE!"},"",{"$error":"#VALUE!"},"",{"$error":"#VALUE!"},"","","",{"$f":"IF(V445>0,COUNTIF(Q$7:Q445,\"=\"&Q445)-1,\"\")","v":""},"",0,0,0,0,0,0,0,0,0,0,0,0,0,0,0,0,0,0,0,0,0,0,0,0,0,0,0,0,0,0,0,0,0,0,0,0,0,0,0,0,0,0,0,0,0,0,0,0,0,0,0,0,0,0,0,0,0,0,0,0,0,0,0,0,0,0,0,0,0,0,0,0,0,0,0,0,0,0,0,null,1,0,0,"","p","p",0]
["",0,0,0,0,null,null,null,null,null,"",{"$error":"#VALUE!"},"",{"$error":"#VALUE!"},"",{"$error":"#VALUE!"},"","","",{"$f":"IF(V446>0,COUNTIF(Q$7:Q446,\"=\"&Q446)-1,\"\")","v":""},"",0,0,0,0,0,0,0,0,0,0,0,0,0,0,0,0,0,0,0,0,0,0,0,0,0,0,0,0,0,0,0,0,0,0,0,0,0,0,0,0,0,0,0,0,0,0,0,0,0,0,0,0,0,0,0,0,0,0,0,0,0,0,0,0,0,0,0,0,0,0,0,0,0,0,0,0,0,0,0,null,1,0,0,"","p","p",0]
["",0,0,0,0,null,null,null,null,null,"",{"$error":"#VALUE!"},"",{"$error":"#VALUE!"},"",{"$error":"#VALUE!"},"","","",{"$f":"IF(V447>0,COUNTIF(Q$7:Q447,\"=\"&Q447)-1,\"\")","v":""},"",0,0,0,0,0,0,{"$f":"IF($CZ447>0,$V447-LEN(SUBSTITUTE($J447,AB$4,\"\")),0)","v":0},0,0,0,0,0,0,0,0,0,{"$f":"IF($CZ447>0,$V447-LEN(SUBSTITUTE($J447,AL$4,\"\")),0)","v":0},0,0,0,0,0,0,0,0,0,{"$f":"IF($CZ447>0,$V447-LEN(SUBSTITUTE($J447,AV$4,\"\")),0)","v":0},0,0,0,0,0,0,0,0,0,0,0,0,{"$f":"IF($CZ447>0,$V447-LEN(SUBSTITUTE($J447,BI$4,\"\")),0)","v":0},0,0,0,0,0,0,0,0,0,{"$f":"IF($CZ447>0,$V447-LEN(SUBSTITUTE($J447,BS$4,\"\")),0)","v":0},0,0,0,0,0,0,0,0,0,{"$f":"IF($CZ447>0,$V447-LEN(SUBSTITUTE($J447,CC$4,\"\")),0)","v":0},0,0,0,0,0,0,0,0,0,0,{"$f":"IF($CZ447>0,$V447-LEN(SUBSTITUTE($J447,CN$4,\"\")),0)","v":0},0,0,0,0,0,0,0,0,null,1,0,0,"","p","p",0]
["",0,0,0,0,null,null,null,null,null,"",{"$error":"#VALUE!"},"",{"$error":"#VALUE!"},"",{"$error":"#VALUE!"},"","","",{"$f":"IF(V448>0,COUNTIF(Q$7:Q448,\"=\"&Q448)-1,\"\")","v":""},"",0,0,0,0,0,0,0,0,0,0,0,0,0,0,0,0,0,0,0,0,0,0,0,0,0,0,0,0,0,0,0,0,0,0,0,0,0,0,0,0,0,0,0,0,0,0,0,0,0,0,0,0,0,0,0,0,0,0,0,0,0,0,0,0,0,0,0,0,0,0,0,0,0,0,0,0,0,0,0,null,1,0,0,"","p","p",0]
["",0,0,0,0,null,null,null,null,null,"",{"$error":"#VALUE!"},"",{"$error":"#VALUE!"},"",{"$error":"#VALUE!"},"","","",{"$f":"IF(V449>0,COUNTIF(Q$7:Q449,\"=\"&Q449)-1,\"\")","v":""},"",0,0,0,0,0,0,0,0,0,0,0,0,0,0,0,0,0,0,0,0,0,0,0,0,0,0,0,0,0,0,0,0,0,0,0,0,0,0,0,0,0,0,0,0,0,0,0,0,0,0,0,0,0,0,0,0,0,0,0,0,0,0,0,0,0,0,0,0,0,0,0,0,0,0,0,0,0,0,0,null,1,0,0,"","p","p",0]
["",0,0,0,0,null,null,null,null,null,"",{"$error":"#VALUE!"},"",{"$error":"#VALUE!"},"",{"$error":"#VALUE!"},"","","",{"$f":"IF(V450>0,COUNTIF(Q$7:Q450,\"=\"&Q450)-1,\"\")","v":""},"",0,0,0,0,0,0,0,0,0,0,0,0,0,0,0,0,0,0,0,0,0,0,0,0,0,0,0,0,0,0,0,0,0,0,0,0,0,0,0,0,0,0,0,0,0,0,0,0,0,0,0,0,0,0,0,0,0,0,0,0,0,0,0,0,0,0,0,0,0,0,0,0,0,0,0,0,0,0,0,null,1,0,0,"","p","p",0]
["",0,0,0,0,null,null,null,null,null,"",{"$error":"#VALUE!"},"",{"$error":"#VALUE!"},"",{"$error":"#VALUE!"},"","","",{"$f":"IF(V451>0,COUNTIF(Q$7:Q451,\"=\"&Q451)-1,\"\")","v":""},"",0,0,0,0,0,0,0,0,0,0,0,0,0,0,0,0,0,0,0,0,0,0,0,0,0,0,0,0,0,0,0,0,0,0,0,0,0,0,0,0,0,0,0,0,0,0,0,0,0,0,0,0,0,0,0,0,0,0,0,0,0,0,0,0,0,0,0,0,0,0,0,0,0,0,0,0,0,0,0,null,1,0,0,"","p","p",0]
["",0,0,0,0,null,null,null,null,null,"",{"$error":"#VALUE!"},"",{"$error":"#VALUE!"},"",{"$error":"#VALUE!"},"","","",{"$f":"IF(V452>0,COUNTIF(Q$7:Q452,\"=\"&Q452)-1,\"\")","v":""},"",0,0,0,0,0,0,0,0,0,0,0,0,0,0,0,0,0,0,0,0,0,0,0,0,0,0,0,0,0,0,0,0,0,0,0,0,0,0,0,0,0,0,0,0,0,0,0,0,0,0,0,0,0,0,0,0,0,0,0,0,0,0,0,0,0,0,0,0,0,0,0,0,0,0,0,0,0,0,0,null,1,0,0,"","p","p",0]
["",0,0,0,0,null,null,null,null,null,"",{"$error":"#VALUE!"},"",{"$error":"#VALUE!"},"",{"$error":"#VALUE!"},"","","",{"$f":"IF(V453>0,COUNTIF(Q$7:Q453,\"=\"&Q453)-1,\"\")","v":""},"",0,0,0,0,0,0,0,0,0,0,0,0,0,0,0,0,0,0,0,0,0,0,0,0,0,0,0,0,0,0,0,0,0,0,0,0,0,0,0,0,0,0,0,0,0,0,0,0,0,0,0,0,0,0,0,0,0,0,0,0,0,0,0,0,0,0,0,0,0,0,0,0,0,0,0,0,0,0,0,null,1,0,0,"","p","p",0]
["",0,0,0,0,null,null,null,null,null,"",{"$error":"#VALUE!"},"",{"$error":"#VALUE!"},"",{"$error":"#VALUE!"},"","","",{"$f":"IF(V454>0,COUNTIF(Q$7:Q454,\"=\"&Q454)-1,\"\")","v":""},"",0,0,0,0,0,0,0,0,0,0,0,0,0,0,0,0,0,0,0,0,0,0,0,0,0,0,0,0,0,0,0,0,0,0,0,0,0,0,0,0,0,0,0,0,0,0,0,0,0,0,0,0,0,0,0,0,0,0,0,0,0,0,0,0,0,0,0,0,0,0,0,0,0,0,0,0,0,0,0,null,1,0,0,"","p","p",0]
["",0,{"$f":"IF($C$2=\"forced-OH\",-1,IF($G455=1,$C$3,IF($G455=2,$D$3,0)))","v":0},{"$f":"IF($F455=1,VLOOKUP($B$2,$DE$5:$DI$11,5,FALSE),0)","v":0},{"$f":"IF($F455=1,VLOOKUP($B$2,$DE$5:$DG$11,3,FALSE),0)","v":0},null,null,null,null,null,"",{"$error":"#VALUE!"},"",{"$error":"#VALUE!"},"",{"$error":"#VALUE!"},"","",{"$f":"IF(V455>0,COUNTIF(Q$7:Q$651,\"<\"&Q455)+1,\"\")","v":""},{"$f":"IF(V455>0,COUNTIF(Q$7:Q455,\"=\"&Q455)-1,\"\")","v":""},"",0,0,0,0,0,0,0,0,0,0,0,0,0,0,0,0,0,0,0,0,0,0,0,0,0,0,0,0,0,0,0,0,0,0,0,0,0,0,0,0,0,0,0,0,0,0,0,0,0,0,0,0,0,0,0,0,0,0,0,0,0,0,0,0,0,0,0,0,0,0,0,0,0,0,{"$f":"IF($CZ455>0,$V455-LEN(SUBSTITUTE($J455,CR$4,\"\")),0)","v":0},0,0,0,0,null,1,0,{"$f":"$V455-$W455-$X455-$Z455-$AA455","v":0},"",{"$f":"IF($C455=0,\"p\",\"\")","v":"p"},"p",{"$f":"IF($F455=1,VLOOKUP($B$2,$DE$5:$DH$11,4,FALSE),0)","v":0}]
["",{"$f":"IF($F456=1,VLOOKUP($B$2,$DE$5:$DG$11,2,FALSE),IF($F456=2,VLOOKUP($B$3,$DE$5:$DG$6,2,FALSE),0))","v":0},0,0,0,null,null,null,null,null,"",{"$error":"#VALUE!"},"",{"$error":"#VALUE!"},"",{"$error":"#VALUE!"},"","","",{"$f":"IF(V456>0,COUNTIF(Q$7:Q456,\"=\"&Q456)-1,\"\")","v":""},"",0,0,0,0,0,0,0,0,0,0,0,0,0,0,0,0,0,0,0,0,0,0,0,0,0,0,0,0,0,0,0,0,0,0,0,0,0,0,0,0,0,0,0,0,0,0,0,0,0,0,0,0,0,0,0,0,0,0,0,0,0,0,0,0,0,0,0,0,0,0,0,0,0,0,0,0,0,0,0,null,1,0,0,"","p","p",0]
["",0,0,0,0,null,null,null,null,null,"",{"$error":"#VALUE!"},"",{"$error":"#VALUE!"},"",{"$error":"#VALUE!"},"","","",{"$f":"IF(V457>0,COUNTIF(Q$7:Q457,\"=\"&Q457)-1,\"\")","v":""},"",0,0,0,0,0,0,{"$f":"IF($CZ457>0,$V457-LEN(SUBSTITUTE($J457,AB$4,\"\")),0)","v":0},0,0,0,0,0,0,0,0,0,{"$f":"IF($CZ457>0,$V457-LEN(SUBSTITUTE($J457,AL$4,\"\")),0)","v":0},0,0,0,0,0,0,0,0,0,{"$f":"IF($CZ457>0,$V457-LEN(SUBSTITUTE($J457,AV$4,\"\")),0)","v":0},0,0,0,0,0,0,0,0,0,0,0,0,{"$f":"IF($CZ457>0,$V457-LEN(SUBSTITUTE($J457,BI$4,\"\")),0)","v":0},0,0,0,0,0,0,0,0,0,{"$f":"IF($CZ457>0,$V457-LEN(SUBSTITUTE($J457,BS$4,\"\")),0)","v":0},0,0,0,0,0,0,0,0,0,{"$f":"IF($CZ457>0,$V457-LEN(SUBSTITUTE($J457,CC$4,\"\")),0)","v":0},0,0,0,0,0,0,0,0,0,0,0,0,0,0,0,0,0,0,0,null,1,0,0,"","p","p",0]
["",0,0,0,0,null,null,null,null,null,"",{"$error":"#VALUE!"},"",{"$error":"#VALUE!"},"",{"$error":"#VALUE!"},"","","",{"$f":"IF(V458>0,COUNTIF(Q$7:Q458,\"=\"&Q458)-1,\"\")","v":""},"",0,0,0,0,0,0,0,0,0,0,0,0,0,0,0,0,0,0,0,0,0,0,0,0,0,0,0,0,0,0,0,0,0,0,0,0,0,0,0,0,0,0,0,0,0,0,0,0,0,0,0,0,0,0,0,0,0,0,0,0,0,0,0,0,0,0,0,0,0,0,0,0,0,0,0,0,0,0,0,null,1,0,0,"","p","p",0]
["",0,0,0,0,null,null,null,null,null,"",{"$error":"#VALUE!"},"",{"$error":"#VALUE!"},"",{"$error":"#VALUE!"},"","","",{"$f":"IF(V459>0,COUNTIF(Q$7:Q459,\"=\"&Q459)-1,\"\")","v":""},"",0,0,0,0,0,0,0,0,0,0,0,0,0,0,0,0,0,0,0,0,0,0,0,0,0,0,0,0,0,0,0,0,0,0,0,0,0,0,0,0,0,0,0,0,0,0,0,0,0,0,0,0,0,0,0,0,0,0,0,0,0,0,0,0,0,0,0,0,0,0,0,0,0,0,0,0,0,0,0,null,1,0,0,"","p","p",0]
["",0,0,0,0,null,null,null,null,null,"",{"$error":"#VALUE!"},"",{"$error":"#VALUE!"},"",{"$error":"#VALUE!"},"","","",{"$f":"IF(V460>0,COUNTIF(Q$7:Q460,\"=\"&Q460)-1,\"\")","v":""},"",0,0,0,0,0,0,0,0,0,0,0,0,0,0,0,0,0,0,0,0,0,0,0,0,0,0,0,0,0,0,0,0,0,0,0,0,0,0,0,0,0,0,0,0,0,0,0,0,0,0,0,0,0,0,0,0,0,0,0,0,0,0,0,0,0,0,0,0,0,0,0,0,0,0,0,0,0,0,0,null,1,0,0,"","p","p",0]
["",0,0,0,0,null,null,null,null,null,"",{"$error":"#VALUE!"},"",{"$error":"#VALUE!"},"",{"$error":"#VALUE!"},"","","",{"$f":"IF(V461>0,COUNTIF(Q$7:Q461,\"=\"&Q461)-1,\"\")","v":""},"",0,0,0,0,0,0,0,0,0,0,0,0,0,0,0,0,0,0,0,0,0,0,0,0,0,0,0,0,0,0,0,0,0,0,0,0,0,0,0,0,0,0,0,0,0,0,0,0,0,0,0,0,0,0,0,0,0,0,0,0,0,0,0,0,0,0,0,0,0,0,0,0,0,0,0,0,0,0,0,null,1,0,0,"","p","p",0]
["",0,0,0,0,null,null,null,null,null,"",{"$error":"#VALUE!"},"",{"$error":"#VALUE!"},"",{"$error":"#VALUE!"},"","","",{"$f":"IF(V462>0,COUNTIF(Q$7:Q462,\"=\"&Q462)-1,\"\")","v":""},"",0,0,0,0,0,0,0,0,0,0,0,0,0,0,0,0,0,0,0,0,0,0,0,0,0,0,0,0,0,0,0,0,0,0,0,0,0,0,0,0,0,0,0,0,0,0,0,0,0,0,0,0,0,0,0,0,0,0,0,0,0,0,0,0,0,0,0,0,0,0,0,0,0,0,0,0,0,0,0,null,1,0,0,"","p","p",0]
["",0,0,0,0,null,null,null,null,null,"",{"$error":"#VALUE!"},"",{"$error":"#VALUE!"},"",{"$error":"#VALUE!"},"","","",{"$f":"IF(V463>0,COUNTIF(Q$7:Q463,\"=\"&Q463)-1,\"\")","v":""},"",0,0,0,0,0,0,0,0,0,0,0,0,0,0,0,0,0,0,0,0,0,0,0,0,0,0,0,0,0,0,0,0,0,0,0,0,0,0,0,0,0,0,0,0,0,0,0,0,0,0,0,0,0,0,0,0,0,0,0,0,0,0,0,0,0,0,0,0,0,0,0,0,0,0,0,0,0,0,0,null,1,0,0,"","p","p",0]
["",0,0,0,0,null,null,null,null,null,"",{"$error":"#VALUE!"},"",{"$error":"#VALUE!"},"",{"$error":"#VALUE!"},"","","",{"$f":"IF(V464>0,COUNTIF(Q$7:Q464,\"=\"&Q464)-1,\"\")","v":""},"",0,0,0,0,0,0,0,0,0,0,0,0,0,0,0,0,0,0,0,0,0,0,0,0,0,0,0,0,0,0,0,0,0,0,0,0,0,0,0,0,0,0,0,0,0,0,0,0,0,0,0,0,0,0,0,0,0,0,0,0,0,0,0,0,0,0,0,0,0,0,0,0,0,0,0,0,0,0,0,null,1,0,0,"","p","p",0]
["",0,0,0,0,null,null,null,null,null,"",{"$error":"#VALUE!"},"",{"$error":"#VALUE!"},"",{"$error":"#VALUE!"},"","","",{"$f":"IF(V465>0,COUNTIF(Q$7:Q465,\"=\"&Q465)-1,\"\")","v":""},"",0,0,0,0,0,0,0,0,0,0,0,0,0,0,0,0,0,0,0,0,0,0,0,0,0,0,0,0,0,0,0,0,0,0,0,0,0,0,0,0,0,0,0,0,0,0,0,0,0,0,0,0,0,0,0,0,0,0,0,0,0,0,0,0,0,0,0,0,0,0,0,0,0,0,0,0,0,0,0,null,1,0,0,"","p","p",0]
["",0,0,0,0,null,null,null,null,null,"",{"$error":"#VALUE!"},"",{"$error":"#VALUE!"},"",{"$error":"#VALUE!"},"","","",{"$f":"IF(V466>0,COUNTIF(Q$7:Q466,\"=\"&Q466)-1,\"\")","v":""},"",0,0,0,0,0,0,0,0,0,0,0,0,0,0,0,0,0,0,0,0,0,0,0,0,0,0,0,0,0,0,0,0,0,0,0,0,0,0,0,0,0,0,0,0,0,0,0,0,0,0,0,0,0,0,0,0,0,0,0,0,0,0,0,0,0,0,0,0,0,0,0,0,0,0,0,0,0,0,0,null,1,0,0,"","p","p",0]
["",0,0,0,0,null,null,null,null,null,"",{"$error":"#VALUE!"},"",{"$error":"#VALUE!"},"",{"$error":"#VALUE!"},"","","",{"$f":"IF(V467>0,COUNTIF(Q$7:Q467,\"=\"&Q467)-1,\"\")","v":""},"",0,0,0,0,0,0,{"$f":"IF($CZ467>0,$V467-LEN(SUBSTITUTE($J467,AB$4,\"\")),0)","v":0},0,0,0,0,0,0,0,0,0,{"$f":"IF($CZ467>0,$V467-LEN(SUBSTITUTE($J467,AL$4,\"\")),0)","v":0},0,0,0,0,0,0,0,0,0,{"$f":"IF($CZ467>0,$V467-LEN(SUBSTITUTE($J467,AV$4,\"\")),0)","v":0},0,0,0,0,0,0,0,0,0,0,0,0,{"$f":"IF($CZ467>0,$V467-LEN(SUBSTITUTE($J467,BI$4,\"\")),0)","v":0},0,0,0,0,0,0,0,0,0,{"$f":"IF($CZ467>0,$V467-LEN(SUBSTITUTE($J467,BS$4,\"\")),0)","v":0},0,0,0,0,0,0,0,0,0,{"$f":"IF($CZ467>0,$V467-LEN(SUBSTITUTE($J467,CC$4,\"\")),0)","v":0},0,0,0,0,0,0,0,0,0,0,{"$f":"IF($CZ467>0,$V467-LEN(SUBSTITUTE($J467,CN$4,\"\")),0)","v":0},0,0,0,0,0,0,0,0,null,1,0,0,"","p","p",0]
["",0,0,0,0,null,null,null,null,null,"",{"$error":"#VALUE!"},"",{"$error":"#VALUE!"},"",{"$error":"#VALUE!"},"","","",{"$f":"IF(V468>0,COUNTIF(Q$7:Q468,\"=\"&Q468)-1,\"\")","v":""},"",0,0,0,0,0,0,0,0,0,0,0,0,0,0,0,0,0,0,0,0,0,0,0,0,0,0,0,0,0,0,0,0,0,0,0,0,0,0,0,0,0,0,0,0,0,0,0,0,0,0,0,0,0,0,0,0,0,0,0,0,0,0,0,0,0,0,0,0,0,0,0,0,0,0,0,0,0,0,0,null,1,0,0,"","p","p",0]
["",0,0,0,0,null,null,null,null,null,"",{"$error":"#VALUE!"},"",{"$error":"#VALUE!"},"",{"$error":"#VALUE!"},"","","",{"$f":"IF(V469>0,COUNTIF(Q$7:Q469,\"=\"&Q469)-1,\"\")","v":""},"",0,0,0,0,0,0,0,0,0,0,0,0,0,0,0,0,0,0,0,0,0,0,0,0,0,0,0,0,0,0,0,0,0,0,0,0,0,0,0,0,0,0,0,0,0,0,0,0,0,0,0,0,0,0,0,0,0,0,0,0,0,0,0,0,0,0,0,0,0,0,0,0,0,0,0,0,0,0,0,null,1,0,0,"","p","p",0]
["",0,0,0,0,null,null,null,null,null,"",{"$error":"#VALUE!"},"",{"$error":"#VALUE!"},"",{"$error":"#VALUE!"},"","","",{"$f":"IF(V470>0,COUNTIF(Q$7:Q470,\"=\"&Q470)-1,\"\")","v":""},"",0,0,0,0,0,0,0,0,0,0,0,0,0,0,0,0,0,0,0,0,0,0,0,0,0,0,0,0,0,0,0,0,0,0,0,0,0,0,0,0,0,0,0,0,0,0,0,0,0,0,0,0,0,0,0,0,0,0,0,0,0,0,0,0,0,0,0,0,0,0,0,0,0,0,0,0,0,0,0,null,1,0,0,"","p","p",0]
["",0,0,0,0,null,null,null,null,null,"",{"$error":"#VALUE!"},"",{"$error":"#VALUE!"},"",{"$error":"#VALUE!"},"","","",{"$f":"IF(V471>0,COUNTIF(Q$7:Q471,\"=\"&Q471)-1,\"\")","v":""},"",0,{"$f":"$V471-LEN(SUBSTITUTE($J471,W$4,\"\"))","v":0},0,0,0,0,0,0,0,0,0,0,0,0,0,0,0,0,0,0,0,0,0,0,0,0,0,0,0,0,0,0,0,0,0,0,0,0,0,0,0,0,0,0,0,0,0,0,0,0,0,0,0,0,0,0,0,0,0,0,0,0,0,0,0,0,0,0,0,0,0,0,0,0,{"$f":"IF($CZ471>0,$V471-LEN(SUBSTITUTE($J471,CR$4,\"\")),0)","v":0},0,0,0,0,null,1,0,0,"","p","p",0]
["",0,0,0,0,null,null,null,null,null,"",{"$error":"#VALUE!"},"",{"$error":"#VALUE!"},"",{"$error":"#VALUE!"},"","","",{"$f":"IF(V472>0,COUNTIF(Q$7:Q472,\"=\"&Q472)-1,\"\")","v":""},"",0,0,0,0,0,0,0,0,0,0,0,0,0,0,0,0,0,0,0,0,0,0,0,0,0,0,0,0,0,0,0,0,0,0,0,0,0,0,0,0,0,0,0,0,0,0,0,0,0,0,0,0,0,0,0,0,0,0,0,0,0,0,0,0,0,0,0,0,0,0,0,0,0,0,0,0,0,0,0,null,1,0,0,"","p","p",0]
["",0,0,0,0,null,null,null,null,null,"",{"$error":"#VALUE!"},"",{"$error":"#VALUE!"},"",{"$error":"#VALUE!"},"","","",{"$f":"IF(V473>0,COUNTIF(Q$7:Q473,\"=\"&Q473)-1,\"\")","v":""},"",0,0,0,0,0,0,0,0,0,0,0,0,0,0,0,0,0,0,0,0,0,0,0,0,0,0,0,0,0,0,0,0,0,0,0,0,0,0,0,0,0,0,0,0,0,0,0,0,0,0,0,0,0,0,0,0,0,0,0,0,0,0,0,0,0,0,0,0,0,0,0,0,0,0,0,0,0,0,0,null,1,0,0,"","p","p",0]
["",0,0,0,0,null,null,null,null,null,"",{"$error":"#VALUE!"},"",{"$error":"#VALUE!"},"",{"$error":"#VALUE!"},"","","",{"$f":"IF(V474>0,COUNTIF(Q$7:Q474,\"=\"&Q474)-1,\"\")","v":""},"",0,0,0,0,0,0,0,0,0,0,0,0,0,0,0,0,0,0,0,0,0,0,0,0,0,0,0,0,0,0,0,0,0,0,0,0,0,0,0,0,0,0,0,0,0,0,0,0,0,0,0,0,0,0,0,0,0,0,0,0,0,0,0,0,0,0,0,0,0,0,0,0,0,0,0,0,0,0,0,null,1,0,0,"","p","p",0]
["",0,0,0,0,null,null,null,null,null,"",{"$error":"#VALUE!"},"",{"$error":"#VALUE!"},"",{"$error":"#VALUE!"},"","","",{"$f":"IF(V475>0,COUNTIF(Q$7:Q475,\"=\"&Q475)-1,\"\")","v":""},"",0,0,0,0,0,0,0,0,0,0,0,0,0,0,0,0,0,0,0,0,0,0,0,0,0,0,0,0,0,0,0,0,0,0,0,0,0,0,0,0,0,0,0,0,0,0,0,0,0,0,0,0,0,0,0,0,0,0,0,0,0,0,0,0,0,0,0,0,0,0,0,0,0,0,0,0,0,0,0,null,1,0,0,"","p","p",0]
["",0,0,0,0,null,null,null,null,null,"",{"$error":"#VALUE!"},"",{"$error":"#VALUE!"},"",{"$error":"#VALUE!"},"","","",{"$f":"IF(V476>0,COUNTIF(Q$7:Q476,\"=\"&Q476)-1,\"\")","v":""},"",0,0,0,0,0,0,0,0,0,0,0,0,0,0,0,0,0,0,0,0,0,0,0,0,0,0,0,0,0,0,0,0,0,0,0,0,0,0,0,0,0,0,0,0,0,0,0,0,0,0,0,0,0,0,0,0,0,0,0,0,0,0,0,0,0,0,0,0,0,0,0,0,0,0,0,0,0,0,0,null,1,0,0,"","p","p",0]
["",0,0,0,0,null,null,null,null,null,"",{"$error":"#VALUE!"},"",{"$error":"#VALUE!"},"",{"$error":"#VALUE!"},"","","",{"$f":"IF(V477>0,COUNTIF(Q$7:Q477,\"=\"&Q477)-1,\"\")","v":""},"",0,0,0,0,0,0,{"$f":"IF($CZ477>0,$V477-LEN(SUBSTITUTE($J477,AB$4,\"\")),0)","v":0},0,0,0,0,0,0,0,0,0,{"$f":"IF($CZ477>0,$V477-LEN(SUBSTITUTE($J477,AL$4,\"\")),0)","v":0},0,0,0,0,0,0,0,0,0,{"$f":"IF($CZ477>0,$V477-LEN(SUBSTITUTE($J477,AV$4,\"\")),0)","v":0},0,0,0,0,0,0,0,0,0,0,0,0,{"$f":"IF($CZ477>0,$V477-LEN(SUBSTITUTE($J477,BI$4,\"\")),0)","v":0},0,0,0,0,0,0,0,0,0,{"$f":"IF($CZ477>0,$V477-LEN(SUBSTITUTE($J477,BS$4,\"\")),0)","v":0},0,0,0,0,0,0,0,0,0,{"$f":"IF($CZ477>0,$V477-LEN(SUBSTITUTE($J477,CC$4,\"\")),0)","v":0},0,0,0,0,0,0,0,0,0,0,0,0,0,0,0,0,0,0,0,null,1,0,0,"","p","p",0]
["",0,0,0,0,null,null,null,null,null,"",{"$error":"#VALUE!"},"",{"$error":"#VALUE!"},"",{"$error":"#VALUE!"},"","","",{"$f":"IF(V478>0,COUNTIF(Q$7:Q478,\"=\"&Q478)-1,\"\")","v":""},"",0,0,0,0,0,0,0,0,0,0,0,0,0,0,0,0,0,0,0,0,0,0,0,0,0,0,0,0,0,0,0,0,0,0,0,0,0,0,0,0,0,0,0,0,0,0,0,0,0,0,0,0,0,0,0,0,0,0,0,0,0,0,0,0,0,0,0,0,0,0,0,0,0,0,0,0,0,0,0,null,1,0,0,"","p","p",0]
["",0,0,0,0,null,null,null,null,null,"",{"$error":"#VALUE!"},"",{"$error":"#VALUE!"},"",{"$error":"#VALUE!"},"","","",{"$f":"IF(V479>0,COUNTIF(Q$7:Q479,\"=\"&Q479)-1,\"\")","v":""},"",0,0,0,0,0,0,0,0,0,0,0,0,0,0,0,0,0,0,0,0,0,0,0,0,0,0,0,0,0,0,0,0,0,0,0,0,0,0,0,0,0,0,0,0,0,0,0,0,0,0,0,0,0,0,0,0,0,0,0,0,0,0,0,0,0,0,0,0,0,0,0,0,0,0,0,0,0,0,0,null,1,0,0,"","p","p",0]
["",0,0,0,0,null,null,null,null,null,"",{"$error":"#VALUE!"},"",{"$error":"#VALUE!"},"",{"$error":"#VALUE!"},"","","",{"$f":"IF(V480>0,COUNTIF(Q$7:Q480,\"=\"&Q480)-1,\"\")","v":""},"",0,0,0,0,0,0,0,0,0,0,0,0,0,0,0,0,0,0,0,0,0,0,0,0,0,0,0,0,0,0,0,0,0,0,0,0,0,0,0,0,0,0,0,0,0,0,0,0,0,0,0,0,0,0,0,0,0,0,0,0,0,0,0,0,0,0,0,0,0,0,0,0,0,0,0,0,0,0,0,null,1,0,0,"","p","p",0]
["",0,0,0,0,null,null,null,null,null,"",{"$error":"#VALUE!"},"",{"$error":"#VALUE!"},"",{"$error":"#VALUE!"},"","","",{"$f":"IF(V481>0,COUNTIF(Q$7:Q481,\"=\"&Q481)-1,\"\")","v":""},"",0,0,0,0,0,0,0,0,0,0,0,0,0,0,0,0,0,0,0,0,0,0,0,0,0,0,0,0,0,0,0,0,0,0,0,0,0,0,0,0,0,0,0,0,0,0,0,0,0,0,0,0,0,0,0,0,0,0,0,0,0,0,0,0,0,0,0,0,0,0,0,0,0,0,0,0,0,0,0,null,1,0,0,"","p","p",0]
["",0,0,0,0,null,null,null,null,null,"",{"$error":"#VALUE!"},"",{"$error":"#VALUE!"},"",{"$error":"#VALUE!"},"","","",{"$f":"IF(V482>0,COUNTIF(Q$7:Q482,\"=\"&Q482)-1,\"\")","v":""},"",0,0,0,0,0,0,0,0,0,0,0,0,0,0,0,0,0,0,0,0,0,0,0,0,0,0,0,0,0,0,0,0,0,0,0,0,0,0,0,0,0,0,0,0,0,0,0,0,0,0,0,0,0,0,0,0,0,0,0,0,0,0,0,0,0,0,0,0,0,0,0,0,0,0,0,0,0,0,0,null,1,0,0,"","p","p",0]
["",0,0,0,0,null,null,null,null,null,"",{"$error":"#VALUE!"},"",{"$error":"#VALUE!"},"",{"$error":"#VALUE!"},"","","",{"$f":"IF(V483>0,COUNTIF(Q$7:Q483,\"=\"&Q483)-1,\"\")","v":""},"",0,0,0,0,0,0,0,0,0,0,0,0,0,0,0,0,0,0,0,0,0,0,0,0,0,0,0,0,0,0,0,0,0,0,0,0,0,0,0,0,0,0,0,0,0,0,0,0,0,0,0,0,0,0,0,0,0,0,0,0,0,0,0,0,0,0,0,0,0,0,0,0,0,0,0,0,0,0,0,null,1,0,0,"","p","p",0]
["",0,0,0,0,null,null,null,null,null,"",{"$error":"#VALUE!"},"",{"$error":"#VALUE!"},"",{"$error":"#VALUE!"},"","","",{"$f":"IF(V484>0,COUNTIF(Q$7:Q484,\"=\"&Q484)-1,\"\")","v":""},"",0,0,0,0,0,0,0,0,0,0,0,0,0,0,0,0,0,0,0,0,0,0,0,0,0,0,0,0,0,0,0,0,0,0,0,0,0,0,0,0,0,0,0,0,0,0,0,0,0,0,0,0,0,0,0,0,0,0,0,0,0,0,0,0,0,0,0,0,0,0,0,0,0,0,0,0,0,0,0,null,1,0,0,"","p","p",0]
["",0,0,0,0,null,null,null,null,null,"",{"$error":"#VALUE!"},"",{"$error":"#VALUE!"},"",{"$error":"#VALUE!"},"","","",{"$f":"IF(V485>0,COUNTIF(Q$7:Q485,\"=\"&Q485)-1,\"\")","v":""},"",0,0,0,0,0,0,0,0,0,0,0,0,0,0,0,0,0,0,0,0,0,0,0,0,0,0,0,0,0,0,0,0,0,0,0,0,0,0,0,0,0,0,0,0,0,0,0,0,0,0,0,0,0,0,0,0,0,0,0,0,0,0,0,0,0,0,0,0,0,0,0,0,0,0,0,0,0,0,0,null,1,0,0,"","p","p",0]
["",0,0,0,0,null,null,null,null,null,"",{"$error":"#VALUE!"},"",{"$error":"#VALUE!"},"",{"$error":"#VALUE!"},"","","",{"$f":"IF(V486>0,COUNTIF(Q$7:Q486,\"=\"&Q486)-1,\"\")","v":""},"",0,0,0,0,0,0,0,0,0,0,0,0,0,0,0,0,0,0,0,0,0,0,0,0,0,0,0,0,0,0,0,0,0,0,0,0,0,0,0,0,0,0,0,0,0,0,0,0,0,0,0,0,0,0,0,0,0,0,0,0,0,0,0,0,0,0,0,0,0,0,0,0,0,0,0,0,0,0,0,null,1,0,0,"","p","p",0]
["",0,0,0,0,null,null,null,null,null,"",{"$error":"#VALUE!"},"",{"$error":"#VALUE!"},"",{"$error":"#VALUE!"},"","","",{"$f":"IF(V487>0,COUNTIF(Q$7:Q487,\"=\"&Q487)-1,\"\")","v":""},"",0,0,0,0,0,0,{"$f":"IF($CZ487>0,$V487-LEN(SUBSTITUTE($J487,AB$4,\"\")),0)","v":0},0,0,0,0,0,0,0,0,0,{"$f":"IF($CZ487>0,$V487-LEN(SUBSTITUTE($J487,AL$4,\"\")),0)","v":0},0,0,0,0,0,0,0,0,0,{"$f":"IF($CZ487>0,$V487-LEN(SUBSTITUTE($J487,AV$4,\"\")),0)","v":0},0,0,0,0,0,0,0,0,0,0,0,0,{"$f":"IF($CZ487>0,$V487-LEN(SUBSTITUTE($J487,BI$4,\"\")),0)","v":0},0,0,0,0,0,0,0,0,0,{"$f":"IF($CZ487>0,$V487-LEN(SUBSTITUTE($J487,BS$4,\"\")),0)","v":0},0,0,0,0,0,0,0,0,0,{"$f":"IF($CZ487>0,$V487-LEN(SUBSTITUTE($J487,CC$4,\"\")),0)","v":0},0,0,0,0,0,0,0,0,0,0,{"$f":"IF($CZ487>0,$V487-LEN(SUBSTITUTE($J487,CN$4,\"\")),0)","v":0},0,0,0,{"$f":"IF($CZ487>0,$V487-LEN(SUBSTITUTE($J487,CR$4,\"\")),0)","v":0},0,0,0,0,null,1,0,0,"","p","p",0]
[{"$f":"IF(V488=0,\"\",A487+1)","v":""},0,0,0,0,null,null,null,null,null,{"$f":"IF(V488=0,\"\",SUMPRODUCT(W$5:CY$5,W488:CY488))","v":""},{"$f":"IF(C488=-1,\"\",K488-18.01528)","v":{"$error":"#VALUE!"}},{"$f":"IF(V488=0,\"\",SUMPRODUCT(W$6:CY$6,W488:CY488))","v":""},{"$f":"IF(C488=-1,\"\",M488-18.0105646861)","v":{"$error":"#VALUE!"}},{"$f":"IF(V488=0,\"\",M488+TRUNC(K488-M488-0.1))","v":""},{"$f":"IF(C488=-1,\"\",O488-18.0105646861)","v":{"$error":"#VALUE!"}},{"$f":"IF(V488>0,ROUND(K488,4),\"\")","v":""},{"$f":"IF(V488>0,S488+T488,\"\")","v":""},"",{"$f":"IF(V488>0,COUNTIF(Q$7:Q488,\"=\"&Q488)-1,\"\")","v":""},{"$f":"IF(V488>0,$R$6-R488+1,\"\")","v":""},{"$f":"LEN(J488)","v":0},0,0,0,0,0,0,0,0,0,0,0,0,0,0,0,0,0,0,0,0,0,0,0,0,0,0,0,0,0,0,0,0,0,0,0,0,0,{"$f":"IF($CZ488>0,$V488-LEN(SUBSTITUTE($J488,BH$4,\"\")),0)+DD488","v":0},0,0,0,0,0,0,0,0,0,0,0,0,0,0,0,0,0,0,0,0,0,0,0,0,0,0,0,0,0,0,0,0,0,0,0,0,0,0,0,{"$f":"V488+B488+C488","v":0},null,{"$f":"-(V488-1)+D488","v":1},{"$f":"E488","v":0},0,{"$f":"IF($B488=0,\"\",IF(F488=1,LEFT($B$2,LEN($B$2)-1),LEFT($B$3,LEN($B$3)-1)))","v":""},"p",{"$f":"DA488&J488&DB488","v":"p"},0]
["",0,0,0,0,null,null,null,null,null,"",{"$error":"#VALUE!"},"",{"$error":"#VALUE!"},"",{"$error":"#VALUE!"},"","","",{"$f":"IF(V489>0,COUNTIF(Q$7:Q489,\"=\"&Q489)-1,\"\")","v":""},"",0,0,0,0,0,0,0,0,0,0,0,0,0,0,0,0,0,0,0,0,0,0,0,0,0,0,0,0,0,0,0,0,0,0,0,0,0,0,0,0,0,0,0,0,0,0,0,0,0,0,0,0,0,0,0,0,0,0,0,0,0,0,0,0,0,0,0,0,0,0,0,0,0,0,0,0,0,0,0,null,1,0,0,"","p","p",0]
["",0,0,0,0,null,null,null,null,null,"",{"$error":"#VALUE!"},"",{"$error":"#VALUE!"},"",{"$error":"#VALUE!"},"","","",{"$f":"IF(V490>0,COUNTIF(Q$7:Q490,\"=\"&Q490)-1,\"\")","v":""},"",0,0,0,0,0,0,0,0,0,0,0,0,0,0,0,0,0,0,0,0,0,0,0,0,0,0,0,0,0,0,0,0,0,0,0,0,0,0,0,0,0,0,0,0,0,0,0,0,0,0,0,0,0,0,0,0,0,0,0,0,0,0,0,0,0,0,0,0,0,0,0,0,0,0,0,0,0,0,0,null,1,0,0,"","p","p",0]
["",0,0,0,0,null,null,null,null,null,"",{"$error":"#VALUE!"},"",{"$error":"#VALUE!"},"",{"$error":"#VALUE!"},"","","",{"$f":"IF(V491>0,COUNTIF(Q$7:Q491,\"=\"&Q491)-1,\"\")","v":""},"",0,0,0,0,0,0,0,0,0,0,0,0,0,0,0,0,0,0,0,0,0,0,0,0,0,0,0,0,0,0,0,0,0,0,0,0,0,0,0,0,0,0,0,0,0,0,0,0,0,0,0,0,0,0,0,0,0,0,0,0,0,0,0,0,0,0,0,0,0,0,0,0,0,0,0,0,0,0,0,null,1,0,0,"","p","p",0]
["",0,0,0,0,null,null,null,null,null,"",{"$error":"#VALUE!"},"",{"$error":"#VALUE!"},"",{"$error":"#VALUE!"},"","","",{"$f":"IF(V492>0,COUNTIF(Q$7:Q492,\"=\"&Q492)-1,\"\")","v":""},"",0,0,0,0,0,0,0,0,0,0,0,0,0,0,0,0,0,0,0,0,0,0,0,0,0,0,0,0,0,0,0,0,0,0,0,0,0,0,0,0,0,0,0,0,0,0,0,0,0,0,0,0,0,0,0,0,0,0,0,0,0,0,0,0,0,0,0,0,0,0,0,0,0,0,0,0,0,0,0,null,1,0,0,"","p","p",0]
["",0,0,0,0,null,null,null,null,null,"",{"$error":"#VALUE!"},"",{"$error":"#VALUE!"},"",{"$error":"#VALUE!"},"","","",{"$f":"IF(V493>0,COUNTIF(Q$7:Q493,\"=\"&Q493)-1,\"\")","v":""},"",0,0,0,0,0,0,0,0,0,0,0,0,0,0,0,0,0,0,0,0,0,0,0,0,0,0,0,0,0,0,0,0,0,0,0,0,0,0,0,0,0,0,0,0,0,0,0,0,0,0,0,0,0,0,0,0,0,0,0,0,0,0,0,0,0,0,0,0,0,0,0,0,0,0,0,0,0,0,0,null,1,0,0,"","p","p",0]
["",0,0,0,0,null,null,null,null,null,"",{"$error":"#VALUE!"},"",{"$error":"#VALUE!"},"",{"$error":"#VALUE!"},"","","",{"$f":"IF(V494>0,COUNTIF(Q$7:Q494,\"=\"&Q494)-1,\"\")","v":""},"",0,0,0,0,0,0,0,0,0,0,0,0,0,0,0,0,0,0,0,0,0,0,0,0,0,0,0,0,0,0,0,0,0,0,0,0,0,0,0,0,0,0,0,0,0,0,0,0,0,0,0,0,0,0,0,0,0,0,0,0,0,0,0,0,0,0,0,0,0,0,0,0,0,0,0,0,0,0,0,null,1,0,0,"","p","p",0]
["",0,0,0,0,null,null,null,null,null,"",{"$error":"#VALUE!"},"",{"$error":"#VALUE!"},"",{"$error":"#VALUE!"},"","","",{"$f":"IF(V495>0,COUNTIF(Q$7:Q495,\"=\"&Q495)-1,\"\")","v":""},"",0,0,0,0,0,0,0,0,0,0,0,0,0,0,0,0,0,0,0,0,0,0,0,0,0,0,0,0,0,0,0,0,0,0,0,0,0,0,0,0,0,0,0,0,0,0,0,0,0,0,0,0,0,0,0,0,0,0,0,0,0,0,0,0,0,0,0,0,0,0,0,0,0,0,0,0,0,0,0,null,1,0,0,"","p","p",0]
["",0,0,0,0,null,null,null,null,null,"",{"$error":"#VALUE!"},"",{"$error":"#VALUE!"},"",{"$error":"#VALUE!"},"","","",{"$f":"IF(V496>0,COUNTIF(Q$7:Q496,\"=\"&Q496)-1,\"\")","v":""},"",0,0,0,0,0,0,0,0,0,0,0,0,0,0,0,0,0,0,0,0,0,0,0,0,0,0,0,0,0,0,0,0,0,0,0,0,0,0,0,0,0,0,0,0,0,0,0,0,0,0,0,0,0,0,0,0,0,0,0,0,0,0,0,0,0,0,0,0,0,0,0,0,0,0,0,0,0,0,0,null,1,0,0,"","p","p",0]
["",0,0,0,0,null,null,null,null,null,"",{"$error":"#VALUE!"},"",{"$error":"#VALUE!"},"",{"$error":"#VALUE!"},"","","",{"$f":"IF(V497>0,COUNTIF(Q$7:Q497,\"=\"&Q497)-1,\"\")","v":""},"",0,0,0,0,0,0,{"$f":"IF($CZ497>0,$V497-LEN(SUBSTITUTE($J497,AB$4,\"\")),0)","v":0},0,0,0,0,0,0,0,0,0,{"$f":"IF($CZ497>0,$V497-LEN(SUBSTITUTE($J497,AL$4,\"\")),0)","v":0},0,0,0,0,0,0,0,0,0,{"$f":"IF($CZ497>0,$V497-LEN(SUBSTITUTE($J497,AV$4,\"\")),0)","v":0},0,0,0,0,0,0,0,0,0,0,0,0,{"$f":"IF($CZ497>0,$V497-LEN(SUBSTITUTE($J497,BI$4,\"\")),0)","v":0},0,0,0,0,0,0,0,0,0,{"$f":"IF($CZ497>0,$V497-LEN(SUBSTITUTE($J497,BS$4,\"\")),0)","v":0},0,0,0,0,0,0,0,0,0,{"$f":"IF($CZ497>0,$V497-LEN(SUBSTITUTE($J497,CC$4,\"\")),0)","v":0},0,0,0,0,0,0,0,0,0,0,0,0,0,0,0,0,0,0,0,null,1,0,0,"","p","p",0]
["",0,0,0,0,null,null,null,null,null,"",{"$error":"#VALUE!"},"",{"$error":"#VALUE!"},"",{"$error":"#VALUE!"},"","","",{"$f":"IF(V498>0,COUNTIF(Q$7:Q498,\"=\"&Q498)-1,\"\")","v":""},"",0,0,0,0,0,0,0,0,0,0,0,0,0,0,0,0,0,0,0,0,0,0,0,0,0,0,0,0,0,0,0,0,0,0,0,0,0,0,0,0,0,0,0,0,0,0,0,0,0,0,0,0,0,0,0,0,0,0,0,0,0,0,0,0,0,0,0,0,0,0,0,0,0,0,0,0,0,0,0,null,1,0,0,"","p","p",0]
["",0,0,0,0,null,null,null,null,null,"",{"$error":"#VALUE!"},"",{"$error":"#VALUE!"},"",{"$error":"#VALUE!"},"","","",{"$f":"IF(V499>0,COUNTIF(Q$7:Q499,\"=\"&Q499)-1,\"\")","v":""},"",0,0,0,0,0,0,0,0,0,0,0,0,0,0,0,0,0,0,0,0,0,0,0,0,0,0,0,0,0,0,0,0,0,0,0,0,0,0,0,0,0,0,0,0,0,0,0,0,0,0,0,0,0,0,0,0,0,0,0,0,0,0,0,0,0,0,0,0,0,0,0,0,0,0,0,0,0,0,0,null,1,0,0,"","p","p",0]
["",0,0,0,0,null,null,null,null,null,"",{"$error":"#VALUE!"},"",{"$error":"#VALUE!"},"",{"$error":"#VALUE!"},"","","",{"$f":"IF(V500>0,COUNTIF(Q$7:Q500,\"=\"&Q500)-1,\"\")","v":""},"",0,0,0,0,0,0,0,0,0,0,0,0,0,0,0,0,0,0,0,0,0,0,0,0,0,0,0,0,0,0,0,0,0,0,0,0,0,0,0,0,0,0,0,0,0,0,0,0,0,0,0,0,0,0,0,0,0,0,0,0,0,0,0,0,0,0,0,0,0,0,0,0,0,0,0,0,0,0,0,null,1,0,0,"","p","p",0]
["",0,0,0,0,null,null,null,null,null,"",{"$error":"#VALUE!"},"",{"$error":"#VALUE!"},"",{"$error":"#VALUE!"},"","","",{"$f":"IF(V501>0,COUNTIF(Q$7:Q501,\"=\"&Q501)-1,\"\")","v":""},"",0,0,0,0,0,0,0,0,0,0,0,0,0,0,0,0,0,0,0,0,0,0,0,0,0,0,0,0,0,0,0,0,0,0,0,0,0,0,0,0,0,0,0,0,0,0,0,0,0,0,0,0,0,0,0,0,0,0,0,0,0,0,0,0,0,0,0,0,0,0,0,0,0,0,0,0,0,0,0,null,1,0,0,"","p","p",0]
["",0,0,0,0,null,null,null,null,null,"",{"$error":"#VALUE!"},"",{"$error":"#VALUE!"},"",{"$error":"#VALUE!"},"","","",{"$f":"IF(V502>0,COUNTIF(Q$7:Q502,\"=\"&Q502)-1,\"\")","v":""},"",0,0,0,0,0,0,0,0,0,0,0,0,0,0,0,0,0,0,0,0,0,0,0,0,0,0,0,0,0,0,0,0,0,0,0,0,0,0,0,0,0,0,0,0,0,0,0,0,0,0,0,0,0,0,0,0,0,0,0,0,0,0,0,0,0,0,0,0,0,0,0,0,0,0,0,0,0,0,0,null,1,0,0,"","p","p",0]
["",0,0,0,0,null,null,null,null,null,"",{"$error":"#VALUE!"},"",{"$error":"#VALUE!"},"",{"$error":"#VALUE!"},"","","",{"$f":"IF(V503>0,COUNTIF(Q$7:Q503,\"=\"&Q503)-1,\"\")","v":""},"",0,0,0,0,0,0,0,0,0,0,0,0,0,0,0,0,0,0,0,0,0,0,0,0,0,0,0,0,0,0,0,0,0,0,0,0,0,0,0,0,0,0,0,0,0,0,0,0,0,0,0,0,0,0,0,0,0,0,0,0,0,0,0,0,0,0,0,0,0,0,0,0,0,0,{"$f":"IF($CZ503>0,$V503-LEN(SUBSTITUTE($J503,CR$4,\"\")),0)","v":0},0,0,0,0,null,1,0,0,"","p","p",0]
["",0,0,0,0,null,null,null,null,null,"",{"$error":"#VALUE!"},"",{"$error":"#VALUE!"},"",{"$error":"#VALUE!"},"","","",{"$f":"IF(V504>0,COUNTIF(Q$7:Q504,\"=\"&Q504)-1,\"\")","v":""},"",0,0,0,0,0,0,0,0,0,0,0,0,0,0,0,0,0,0,0,0,0,0,0,0,0,0,0,0,0,0,0,0,0,0,0,0,0,0,0,0,0,0,0,0,0,0,0,0,0,0,0,0,0,0,0,0,0,0,0,0,0,0,0,0,0,0,0,0,0,0,0,0,0,0,0,0,0,0,0,null,1,0,0,"","p","p",0]
["",0,0,0,0,null,null,null,null,null,"",{"$error":"#VALUE!"},"",{"$error":"#VALUE!"},"",{"$error":"#VALUE!"},"","","",{"$f":"IF(V505>0,COUNTIF(Q$7:Q505,\"=\"&Q505)-1,\"\")","v":""},"",0,0,0,0,0,0,0,0,0,0,0,0,0,0,0,0,0,0,0,0,0,0,0,0,0,0,0,0,0,0,0,0,0,0,0,0,0,0,0,0,0,0,0,0,0,0,0,0,0,0,0,0,0,0,0,0,0,0,0,0,0,0,0,0,0,0,0,0,0,0,0,0,0,0,0,0,0,0,0,null,1,0,0,"","p","p",0]
["",0,0,0,0,null,null,null,null,null,"",{"$error":"#VALUE!"},"",{"$error":"#VALUE!"},"",{"$error":"#VALUE!"},"","","",{"$f":"IF(V506>0,COUNTIF(Q$7:Q506,\"=\"&Q506)-1,\"\")","v":""},"",0,0,0,0,0,0,0,0,0,0,0,0,0,0,0,0,0,0,0,0,0,0,0,0,0,0,0,0,0,0,0,0,0,0,0,0,0,0,0,0,0,0,0,0,0,0,0,0,0,0,0,0,0,0,0,0,0,0,0,0,0,0,0,0,0,0,0,0,0,0,0,0,0,0,0,0,0,0,0,null,1,0,0,"","p","p",0]
["",0,0,0,0,null,null,null,null,null,"",{"$error":"#VALUE!"},"",{"$error":"#VALUE!"},"",{"$error":"#VALUE!"},"","","",{"$f":"IF(V507>0,COUNTIF(Q$7:Q507,\"=\"&Q507)-1,\"\")","v":""},"",0,0,0,0,0,0,{"$f":"IF($CZ507>0,$V507-LEN(SUBSTITUTE($J507,AB$4,\"\")),0)","v":0},0,0,0,0,0,0,0,0,0,{"$f":"IF($CZ507>0,$V507-LEN(SUBSTITUTE($J507,AL$4,\"\")),0)","v":0},0,0,0,0,0,0,0,0,0,{"$f":"IF($CZ507>0,$V507-LEN(SUBSTITUTE($J507,AV$4,\"\")),0)","v":0},0,0,0,0,0,0,0,0,0,0,0,0,{"$f":"IF($CZ507>0,$V507-LEN(SUBSTITUTE($J507,BI$4,\"\")),0)","v":0},0,0,0,0,0,0,0,0,0,{"$f":"IF($CZ507>0,$V507-LEN(SUBSTITUTE($J507,BS$4,\"\")),0)","v":0},0,0,0,0,0,0,0,0,0,{"$f":"IF($CZ507>0,$V507-LEN(SUBSTITUTE($J507,CC$4,\"\")),0)","v":0},0,0,0,0,0,0,0,0,0,0,{"$f":"IF($CZ507>0,$V507-LEN(SUBSTITUTE($J507,CN$4,\"\")),0)","v":0},0,0,0,0,0,0,0,0,null,1,0,0,"","p","p",0]
["",0,0,0,0,null,null,null,null,null,"",{"$error":"#VALUE!"},"",{"$error":"#VALUE!"},"",{"$error":"#VALUE!"},"","","",{"$f":"IF(V508>0,COUNTIF(Q$7:Q508,\"=\"&Q508)-1,\"\")","v":""},"",0,0,0,0,0,0,0,0,0,0,0,0,0,0,0,0,0,0,0,0,0,0,0,0,0,0,0,0,0,0,0,0,0,0,0,0,0,0,0,0,0,0,0,0,0,0,0,0,0,0,0,0,0,0,0,0,0,0,0,0,0,0,0,0,0,0,0,0,0,0,0,0,0,0,0,0,0,0,0,null,1,0,0,"","p","p",0]
["",0,0,0,0,null,null,null,null,null,"",{"$error":"#VALUE!"},"",{"$error":"#VALUE!"},"",{"$error":"#VALUE!"},"","","",{"$f":"IF(V509>0,COUNTIF(Q$7:Q509,\"=\"&Q509)-1,\"\")","v":""},"",0,0,0,0,0,0,0,0,0,0,0,0,0,0,0,0,0,0,0,0,0,0,0,0,0,0,0,0,0,0,0,0,0,0,0,0,0,0,0,0,0,0,0,0,0,0,0,0,0,0,0,0,0,0,0,0,0,0,0,0,0,0,0,0,0,0,0,0,0,0,0,0,0,0,0,0,0,0,0,null,1,0,0,"","p","p",0]
["",0,0,0,0,null,null,null,null,null,"",{"$error":"#VALUE!"},"",{"$error":"#VALUE!"},"",{"$error":"#VALUE!"},"","","",{"$f":"IF(V510>0,COUNTIF(Q$7:Q510,\"=\"&Q510)-1,\"\")","v":""},"",0,0,0,0,0,0,0,0,0,0,0,0,0,0,0,0,0,0,0,0,0,0,0,0,0,0,0,0,0,0,0,0,0,0,0,0,0,0,0,0,0,0,0,0,0,0,0,0,0,0,0,0,0,0,0,0,0,0,0,0,0,0,0,0,0,0,0,0,0,0,0,0,0,0,0,0,0,0,0,null,1,0,0,"","p","p",0]
["",0,0,0,0,null,null,null,null,null,"",{"$error":"#VALUE!"},"",{"$error":"#VALUE!"},"",{"$error":"#VALUE!"},"","","",{"$f":"IF(V511>0,COUNTIF(Q$7:Q511,\"=\"&Q511)-1,\"\")","v":""},"",0,0,0,0,0,0,0,0,0,0,0,0,0,0,0,0,0,0,0,0,0,0,0,0,0,0,0,0,0,0,0,0,0,0,0,0,0,0,0,0,0,0,0,0,0,0,0,0,0,0,0,0,0,0,0,0,0,0,0,0,0,0,0,0,0,0,0,0,0,0,0,0,0,0,0,0,0,0,0,null,1,0,0,"","p","p",0]
["",0,0,0,0,null,null,null,null,null,"",{"$error":"#VALUE!"},"",{"$error":"#VALUE!"},"",{"$error":"#VALUE!"},"","","",{"$f":"IF(V512>0,COUNTIF(Q$7:Q512,\"=\"&Q512)-1,\"\")","v":""},"",0,0,0,0,0,0,0,0,0,0,0,0,0,0,0,0,0,0,0,0,0,0,0,0,0,0,0,0,0,0,0,0,0,0,0,0,0,0,0,0,0,0,0,0,0,0,0,0,0,0,0,0,0,0,0,0,0,0,0,0,0,0,0,0,0,0,0,0,0,0,0,0,0,0,0,0,0,0,0,null,1,0,0,"","p","p",0]
["",0,0,0,0,null,null,null,null,null,"",{"$error":"#VALUE!"},"",{"$error":"#VALUE!"},"",{"$error":"#VALUE!"},"","","",{"$f":"IF(V513>0,COUNTIF(Q$7:Q513,\"=\"&Q513)-1,\"\")","v":""},"",0,0,0,0,0,0,0,0,0,0,0,0,0,0,0,0,0,0,0,0,0,0,0,0,0,0,0,0,0,0,0,0,0,0,0,0,0,0,0,0,0,0,0,0,0,0,0,0,0,0,0,0,0,0,0,0,0,0,0,0,0,0,0,0,0,0,0,0,0,0,0,0,0,0,0,0,0,0,0,null,1,0,0,"","p","p",0]
["",0,0,0,0,null,null,null,null,null,"",{"$error":"#VALUE!"},"",{"$error":"#VALUE!"},"",{"$error":"#VALUE!"},"","","",{"$f":"IF(V514>0,COUNTIF(Q$7:Q514,\"=\"&Q514)-1,\"\")","v":""},"",0,0,0,0,0,0,0,0,0,0,0,0,0,0,0,0,0,0,0,0,0,0,0,0,0,0,0,0,0,0,0,0,0,0,0,0,0,0,0,0,0,0,0,0,0,0,0,0,0,0,0,0,0,0,0,0,0,0,0,0,0,0,0,0,0,0,0,0,0,0,0,0,0,0,0,0,0,0,0,null,1,0,0,"","p","p",0]
["",0,0,0,0,null,null,null,null,null,"",{"$error":"#VALUE!"},"",{"$error":"#VALUE!"},"",{"$error":"#VALUE!"},"","","",{"$f":"IF(V515>0,COUNTIF(Q$7:Q515,\"=\"&Q515)-1,\"\")","v":""},"",0,0,0,0,0,0,0,0,0,0,0,0,0,0,0,0,0,0,0,0,0,0,0,0,0,0,0,0,0,0,0,0,0,0,0,0,0,0,0,0,0,0,0,0,0,0,0,0,0,0,0,0,0,0,0,0,0,0,0,0,0,0,0,0,0,0,0,0,0,0,0,0,0,0,0,0,0,0,0,null,1,0,0,"","p","p",0]
["",0,0,0,0,null,null,null,null,null,"",{"$error":"#VALUE!"},"",{"$error":"#VALUE!"},"",{"$error":"#VALUE!"},"","","",{"$f":"IF(V516>0,COUNTIF(Q$7:Q516,\"=\"&Q516)-1,\"\")","v":""},"",0,0,0,0,0,0,0,0,0,0,0,0,0,0,0,0,0,0,0,0,0,0,0,0,0,0,0,0,0,0,0,0,0,0,0,0,0,0,0,0,0,0,0,0,0,0,0,0,0,0,0,0,0,0,0,0,0,0,0,0,0,0,0,0,0,0,0,0,0,0,0,0,0,0,0,0,0,0,0,null,1,0,0,"","p","p",0]
["",0,0,0,0,null,null,null,null,null,"",{"$error":"#VALUE!"},"",{"$error":"#VALUE!"},"",{"$error":"#VALUE!"},"","","",{"$f":"IF(V517>0,COUNTIF(Q$7:Q517,\"=\"&Q517)-1,\"\")","v":""},"",0,0,0,0,0,0,{"$f":"IF($CZ517>0,$V517-LEN(SUBSTITUTE($J517,AB$4,\"\")),0)","v":0},0,0,0,0,0,0,0,0,0,{"$f":"IF($CZ517>0,$V517-LEN(SUBSTITUTE($J517,AL$4,\"\")),0)","v":0},0,0,0,0,0,0,0,0,0,{"$f":"IF($CZ517>0,$V517-LEN(SUBSTITUTE($J517,AV$4,\"\")),0)","v":0},0,0,0,0,0,0,0,0,0,0,0,0,{"$f":"IF($CZ517>0,$V517-LEN(SUBSTITUTE($J517,BI$4,\"\")),0)","v":0},0,0,0,0,0,0,0,0,0,{"$f":"IF($CZ517>0,$V517-LEN(SUBSTITUTE($J517,BS$4,\"\")),0)","v":0},0,0,0,0,0,0,0,0,0,{"$f":"IF($CZ517>0,$V517-LEN(SUBSTITUTE($J517,CC$4,\"\")),0)","v":0},0,0,0,0,0,0,0,0,0,0,0,0,0,0,0,0,0,0,0,null,1,0,0,"","p","p",0]
["",0,0,0,0,null,null,null,null,null,"",{"$error":"#VALUE!"},"",{"$error":"#VALUE!"},"",{"$error":"#VALUE!"},"","","",{"$f":"IF(V518>0,COUNTIF(Q$7:Q518,\"=\"&Q518)-1,\"\")","v":""},"",0,0,0,0,0,0,0,0,0,0,0,0,0,0,0,0,0,0,0,0,0,0,0,0,0,0,0,0,0,0,0,0,0,0,0,0,0,0,0,0,0,0,0,0,0,0,0,0,0,0,0,0,0,0,0,0,0,0,0,0,0,0,0,0,0,0,0,0,0,0,0,0,0,0,0,0,0,0,0,null,1,0,0,"","p","p",0]
["",0,{"$f":"IF($C$2=\"forced-OH\",-1,IF($G519=1,$C$3,IF($G519=2,$D$3,0)))","v":0},{"$f":"IF($F519=1,VLOOKUP($B$2,$DE$5:$DI$11,5,FALSE),0)","v":0},{"$f":"IF($F519=1,VLOOKUP($B$2,$DE$5:$DG$11,3,FALSE),0)","v":0},null,null,null,null,null,"",{"$error":"#VALUE!"},"",{"$error":"#VALUE!"},"",{"$error":"#VALUE!"},"","",{"$f":"IF(V519>0,COUNTIF(Q$7:Q$651,\"<\"&Q519)+1,\"\")","v":""},{"$f":"IF(V519>0,COUNTIF(Q$7:Q519,\"=\"&Q519)-1,\"\")","v":""},"",0,0,0,0,0,0,0,0,0,0,0,0,0,0,0,0,0,0,0,0,0,0,0,0,0,0,0,0,0,0,0,0,0,0,0,0,0,0,0,0,0,0,0,0,0,0,0,0,0,0,0,0,0,0,0,0,0,0,0,0,0,0,0,0,0,0,0,0,0,0,0,0,0,0,{"$f":"IF($CZ519>0,$V519-LEN(SUBSTITUTE($J519,CR$4,\"\")),0)","v":0},0,0,0,0,null,1,0,{"$f":"$V519-$W519-$X519-$Z519-$AA519","v":0},"",{"$f":"IF($C519=0,\"p\",\"\")","v":"p"},"p",{"$f":"IF($F519=1,VLOOKUP($B$2,$DE$5:$DH$11,4,FALSE),0)","v":0}]
["",{"$f":"IF($F520=1,VLOOKUP($B$2,$DE$5:$DG$11,2,FALSE),IF($F520=2,VLOOKUP($B$3,$DE$5:$DG$6,2,FALSE),0))","v":0},0,0,0,null,null,null,null,null,"",{"$error":"#VALUE!"},"",{"$error":"#VALUE!"},"",{"$error":"#VALUE!"},"","","",{"$f":"IF(V520>0,COUNTIF(Q$7:Q520,\"=\"&Q520)-1,\"\")","v":""},"",0,0,0,0,0,0,0,0,0,0,0,0,0,0,0,0,0,0,0,0,0,0,0,0,0,0,0,0,0,0,0,0,0,0,0,0,0,0,0,0,0,0,0,0,0,0,0,0,0,0,0,0,0,0,0,0,0,0,0,0,0,0,0,0,0,0,0,0,0,0,0,0,0,0,0,0,0,0,0,null,1,0,0,"","p","p",0]
["",0,0,0,0,null,null,null,null,null,"",{"$error":"#VALUE!"},"",{"$error":"#VALUE!"},"",{"$error":"#VALUE!"},"","","",{"$f":"IF(V521>0,COUNTIF(Q$7:Q521,\"=\"&Q521)-1,\"\")","v":""},"",0,0,0,0,0,0,0,0,0,0,0,0,0,0,0,0,0,0,0,0,0,0,0,0,0,0,0,0,0,0,0,0,0,0,0,0,0,0,0,0,0,0,0,0,0,0,0,0,0,0,0,0,0,0,0,0,0,0,0,0,0,0,0,0,0,0,0,0,0,0,0,0,0,0,0,0,0,0,0,null,1,0,0,"","p","p",0]
["",0,0,0,0,null,null,null,null,null,"",{"$error":"#VALUE!"},"",{"$error":"#VALUE!"},"",{"$error":"#VALUE!"},"","","",{"$f":"IF(V522>0,COUNTIF(Q$7:Q522,\"=\"&Q522)-1,\"\")","v":""},"",0,{"$f":"$V522-LEN(SUBSTITUTE($J522,W$4,\"\"))","v":0},0,0,0,0,0,0,0,0,0,0,0,0,0,0,0,0,0,0,0,0,0,0,0,0,0,0,0,0,0,0,0,0,0,0,0,0,0,0,0,0,0,0,0,0,0,0,0,0,0,0,0,0,0,0,0,0,0,0,0,0,0,0,0,0,0,0,0,0,0,0,0,0,0,0,0,0,0,null,1,0,0,"","p","p",0]
["",0,0,0,0,null,null,null,null,null,"",{"$error":"#VALUE!"},"",{"$error":"#VALUE!"},"",{"$error":"#VALUE!"},"","","",{"$f":"IF(V523>0,COUNTIF(Q$7:Q523,\"=\"&Q523)-1,\"\")","v":""},"",0,0,0,0,0,0,0,0,0,0,0,0,0,0,0,0,0,0,0,0,0,0,0,0,0,0,0,0,0,0,0,0,0,0,0,0,0,0,0,0,0,0,0,0,0,0,0,0,0,0,0,0,0,0,0,0,0,0,0,0,0,0,0,0,0,0,0,0,0,0,0,0,0,0,0,0,0,0,0,null,1,0,0,"","p","p",0]
["",0,0,0,0,null,null,null,null,null,"",{"$error":"#VALUE!"},"",{"$error":"#VALUE!"},"",{"$error":"#VALUE!"},"","","",{"$f":"IF(V524>0,COUNTIF(Q$7:Q524,\"=\"&Q524)-1,\"\")","v":""},"",0,0,0,0,0,0,0,0,0,0,0,0,0,0,0,0,0,0,0,0,0,0,0,0,0,0,0,0,0,0,0,0,0,0,0,0,0,0,0,0,0,0,0,0,0,0,0,0,0,0,0,0,0,0,0,0,0,0,0,0,0,0,0,0,0,0,0,0,0,0,0,0,0,0,0,0,0,0,0,null,1,0,0,"","p","p",0]
["",0,0,0,0,null,null,null,null,null,"",{"$error":"#VALUE!"},"",{"$error":"#VALUE!"},"",{"$error":"#VALUE!"},"","","",{"$f":"IF(V525>0,COUNTIF(Q$7:Q525,\"=\"&Q525)-1,\"\")","v":""},"",0,0,0,0,0,0,0,0,0,0,0,0,0,0,0,0,0,0,0,0,0,0,0,0,0,0,0,0,0,0,0,0,0,0,0,0,0,0,0,0,0,0,0,0,0,0,0,0,0,0,0,0,0,0,0,0,0,0,0,0,0,0,0,0,0,0,0,0,0,0,0,0,0,0,0,0,0,0,0,null,1,0,0,"","p","p",0]
["",0,0,0,0,null,null,null,null,null,"",{"$error":"#VALUE!"},"",{"$error":"#VALUE!"},"",{"$error":"#VALUE!"},"","","",{"$f":"IF(V526>0,COUNTIF(Q$7:Q526,\"=\"&Q526)-1,\"\")","v":""},"",0,0,0,0,0,0,0,0,0,0,0,0,0,0,0,0,0,0,0,0,0,0,0,0,0,0,0,0,0,0,0,0,0,0,0,0,0,0,0,0,0,0,0,0,0,0,0,0,0,0,0,0,0,0,0,0,0,0,0,0,0,0,0,0,0,0,0,0,0,0,0,0,0,0,0,0,0,0,0,null,1,0,0,"","p","p",0]
["",0,0,0,0,null,null,null,null,null,"",{"$error":"#VALUE!"},"",{"$error":"#VALUE!"},"",{"$error":"#VALUE!"},"","","",{"$f":"IF(V527>0,COUNTIF(Q$7:Q527,\"=\"&Q527)-1,\"\")","v":""},"",0,0,0,0,0,0,{"$f":"IF($CZ527>0,$V527-LEN(SUBSTITUTE($J527,AB$4,\"\")),0)","v":0},0,0,0,0,0,0,0,0,0,{"$f":"IF($CZ527>0,$V527-LEN(SUBSTITUTE($J527,AL$4,\"\")),0)","v":0},0,0,0,0,0,0,0,0,0,{"$f":"IF($CZ527>0,$V527-LEN(SUBSTITUTE($J527,AV$4,\"\")),0)","v":0},0,0,0,0,0,0,0,0,0,0,0,0,{"$f":"IF($CZ527>0,$V527-LEN(SUBSTITUTE($J527,BI$4,\"\")),0)","v":0},0,0,0,0,0,0,0,0,0,{"$f":"IF($CZ527>0,$V527-LEN(SUBSTITUTE($J527,BS$4,\"\")),0)","v":0},0,0,0,0,0,0,0,0,0,{"$f":"IF($CZ527>0,$V527-LEN(SUBSTITUTE($J527,CC$4,\"\")),0)","v":0},0,0,0,0,0,0,0,0,0,0,{"$f":"IF($CZ527>0,$V527-LEN(SUBSTITUTE($J527,CN$4,\"\")),0)","v":0},0,0,0,0,0,0,0,0,null,1,0,0,"","p","p",0]
["",0,0,0,0,null,null,null,null,null,"",{"$error":"#VALUE!"},"",{"$error":"#VALUE!"},"",{"$error":"#VALUE!"},"","","",{"$f":"IF(V528>0,COUNTIF(Q$7:Q528,\"=\"&Q528)-1,\"\")","v":""},"",0,0,0,0,0,0,0,0,0,0,0,0,0,0,0,0,0,0,0,0,0,0,0,0,0,0,0,0,0,0,0,0,0,0,0,0,0,0,0,0,0,0,0,0,0,0,0,0,0,0,0,0,0,0,0,0,0,0,0,0,0,0,0,0,0,0,0,0,0,0,0,0,0,0,0,0,0,0,0,null,1,0,0,"","p","p",0]
["",0,0,0,0,null,null,null,null,null,"",{"$error":"#VALUE!"},"",{"$error":"#VALUE!"},"",{"$error":"#VALUE!"},"","","",{"$f":"IF(V529>0,COUNTIF(Q$7:Q529,\"=\"&Q529)-1,\"\")","v":""},"",0,0,0,0,0,0,0,0,0,0,0,0,0,0,0,0,0,0,0,0,0,0,0,0,0,0,0,0,0,0,0,0,0,0,0,0,0,0,0,0,0,0,0,0,0,0,0,0,0,0,0,0,0,0,0,0,0,0,0,0,0,0,0,0,0,0,0,0,0,0,0,0,0,0,0,0,0,0,0,null,1,0,0,"","p","p",0]
["",0,0,0,0,null,null,null,null,null,"",{"$error":"#VALUE!"},"",{"$error":"#VALUE!"},"",{"$error":"#VALUE!"},"","","",{"$f":"IF(V530>0,COUNTIF(Q$7:Q530,\"=\"&Q530)-1,\"\")","v":""},"",0,0,0,0,0,0,0,0,0,0,0,0,0,0,0,0,0,0,0,0,0,0,0,0,0,0,0,0,0,0,0,0,0,0,0,0,0,0,0,0,0,0,0,0,0,0,0,0,0,0,0,0,0,0,0,0,0,0,0,0,0,0,0,0,0,0,0,0,0,0,0,0,0,0,0,0,0,0,0,null,1,0,0,"","p","p",0]
["",0,0,0,0,null,null,null,null,null,"",{"$error":"#VALUE!"},"",{"$error":"#VALUE!"},"",{"$error":"#VALUE!"},"","","",{"$f":"IF(V531>0,COUNTIF(Q$7:Q531,\"=\"&Q531)-1,\"\")","v":""},"",0,0,0,0,0,0,0,0,0,0,0,0,0,0,0,0,0,0,0,0,0,0,0,0,0,0,0,0,0,0,0,0,0,0,0,0,0,0,0,0,0,0,0,0,0,0,0,0,0,0,0,0,0,0,0,0,0,0,0,0,0,0,0,0,0,0,0,0,0,0,0,0,0,0,0,0,0,0,0,null,1,0,0,"","p","p",0]
["",0,0,0,0,null,null,null,null,null,"",{"$error":"#VALUE!"},"",{"$error":"#VALUE!"},"",{"$error":"#VALUE!"},"","","",{"$f":"IF(V532>0,COUNTIF(Q$7:Q532,\"=\"&Q532)-1,\"\")","v":""},"",0,0,0,0,0,0,0,0,0,0,0,0,0,0,0,0,0,0,0,0,0,0,0,0,0,0,0,0,0,0,0,0,0,0,0,0,0,0,0,0,0,0,0,0,0,0,0,0,0,0,0,0,0,0,0,0,0,0,0,0,0,0,0,0,0,0,0,0,0,0,0,0,0,0,0,0,0,0,0,null,1,0,0,"","p","p",0]
["",0,0,0,0,null,null,null,null,null,"",{"$error":"#VALUE!"},"",{"$error":"#VALUE!"},"",{"$error":"#VALUE!"},"","","",{"$f":"IF(V533>0,COUNTIF(Q$7:Q533,\"=\"&Q533)-1,\"\")","v":""},"",0,0,0,0,0,0,0,0,0,0,0,0,0,0,0,0,0,0,0,0,0,0,0,0,0,0,0,0,0,0,0,0,0,0,0,0,0,0,0,0,0,0,0,0,0,0,0,0,0,0,0,0,0,0,0,0,0,0,0,0,0,0,0,0,0,0,0,0,0,0,0,0,0,0,0,0,0,0,0,null,1,0,0,"","p","p",0]
["",0,0,0,0,null,null,null,null,null,"",{"$error":"#VALUE!"},"",{"$error":"#VALUE!"},"",{"$error":"#VALUE!"},"","","",{"$f":"IF(V534>0,COUNTIF(Q$7:Q534,\"=\"&Q534)-1,\"\")","v":""},"",0,0,0,0,0,0,0,0,0,0,0,0,0,0,0,0,0,0,0,0,0,0,0,0,0,0,0,0,0,0,0,0,0,0,0,0,0,0,0,0,0,0,0,0,0,0,0,0,0,0,0,0,0,0,0,0,0,0,0,0,0,0,0,0,0,0,0,0,0,0,0,0,0,0,0,0,0,0,0,null,1,0,0,"","p","p",0]
["",0,0,0,0,null,null,null,null,null,"",{"$error":"#VALUE!"},"",{"$error":"#VALUE!"},"",{"$error":"#VALUE!"},"","","",{"$f":"IF(V535>0,COUNTIF(Q$7:Q535,\"=\"&Q535)-1,\"\")","v":""},"",0,0,0,0,0,0,0,0,0,0,0,0,0,0,0,0,0,0,0,0,0,0,0,0,0,0,0,0,0,0,0,0,0,0,0,0,0,0,0,0,0,0,0,0,0,0,0,0,0,0,0,0,0,0,0,0,0,0,0,0,0,0,0,0,0,0,0,0,0,0,0,0,0,0,{"$f":"IF($CZ535>0,$V535-LEN(SUBSTITUTE($J535,CR$4,\"\")),0)","v":0},0,0,0,0,null,1,0,0,"","p","p",0]
["",0,0,0,0,null,null,null,null,null,"",{"$error":"#VALUE!"},"",{"$error":"#VALUE!"},"",{"$error":"#VALUE!"},"","","",{"$f":"IF(V536>0,COUNTIF(Q$7:Q536,\"=\"&Q536)-1,\"\")","v":""},"",0,0,0,0,0,0,0,0,0,0,0,0,0,0,0,0,0,0,0,0,0,0,0,0,0,0,0,0,0,0,0,0,0,0,0,0,0,0,0,0,0,0,0,0,0,0,0,0,0,0,0,0,0,0,0,0,0,0,0,0,0,0,0,0,0,0,0,0,0,0,0,0,0,0,0,0,0,0,0,null,1,0,0,"","p","p",0]
["",0,0,0,0,null,null,null,null,null,"",{"$error":"#VALUE!"},"",{"$error":"#VALUE!"},"",{"$error":"#VALUE!"},"","","",{"$f":"IF(V537>0,COUNTIF(Q$7:Q537,\"=\"&Q537)-1,\"\")","v":""},"",0,0,0,0,0,0,{"$f":"IF($CZ537>0,$V537-LEN(SUBSTITUTE($J537,AB$4,\"\")),0)","v":0},0,0,0,0,0,0,0,0,0,{"$f":"IF($CZ537>0,$V537-LEN(SUBSTITUTE($J537,AL$4,\"\")),0)","v":0},0,0,0,0,0,0,0,0,0,{"$f":"IF($CZ537>0,$V537-LEN(SUBSTITUTE($J537,AV$4,\"\")),0)","v":0},0,0,0,0,0,0,0,0,0,0,0,0,{"$f":"IF($CZ537>0,$V537-LEN(SUBSTITUTE($J537,BI$4,\"\")),0)","v":0},0,0,0,0,0,0,0,0,0,{"$f":"IF($CZ537>0,$V537-LEN(SUBSTITUTE($J537,BS$4,\"\")),0)","v":0},0,0,0,0,0,0,0,0,0,{"$f":"IF($CZ537>0,$V537-LEN(SUBSTITUTE($J537,CC$4,\"\")),0)","v":0},0,0,0,0,0,0,0,0,0,0,0,0,0,0,0,0,0,0,0,null,1,0,0,"","p","p",0]
["",0,0,0,0,null,null,null,null,null,"",{"$error":"#VALUE!"},"",{"$error":"#VALUE!"},"",{"$error":"#VALUE!"},"","","",{"$f":"IF(V538>0,COUNTIF(Q$7:Q538,\"=\"&Q538)-1,\"\")","v":""},"",0,0,0,0,0,0,0,0,0,0,0,0,0,0,0,0,0,0,0,0,0,0,0,0,0,0,0,0,0,0,0,0,0,0,0,0,0,0,0,0,0,0,0,0,0,0,0,0,0,0,0,0,0,0,0,0,0,0,0,0,0,0,0,0,0,0,0,0,0,0,0,0,0,0,0,0,0,0,0,null,1,0,0,"","p","p",0]
["",0,0,0,0,null,null,null,null,null,"",{"$error":"#VALUE!"},"",{"$error":"#VALUE!"},"",{"$error":"#VALUE!"},"","","",{"$f":"IF(V539>0,COUNTIF(Q$7:Q539,\"=\"&Q539)-1,\"\")","v":""},"",0,0,0,0,0,0,0,0,0,0,0,0,0,0,0,0,0,0,0,0,0,0,0,0,0,0,0,0,0,0,0,0,0,0,0,0,0,0,0,0,0,0,0,0,0,0,0,0,0,0,0,0,0,0,0,0,0,0,0,0,0,0,0,0,0,0,0,0,0,0,0,0,0,0,0,0,0,0,0,null,1,0,0,"","p","p",0]
["",0,0,0,0,null,null,null,null,null,"",{"$error":"#VALUE!"},"",{"$error":"#VALUE!"},"",{"$error":"#VALUE!"},"","","",{"$f":"IF(V540>0,COUNTIF(Q$7:Q540,\"=\"&Q540)-1,\"\")","v":""},"",0,0,0,0,0,0,0,0,0,0,0,0,0,0,0,0,0,0,0,0,0,0,0,0,0,0,0,0,0,0,0,0,0,0,0,0,0,0,0,0,0,0,0,0,0,0,0,0,0,0,0,0,0,0,0,0,0,0,0,0,0,0,0,0,0,0,0,0,0,0,0,0,0,0,0,0,0,0,0,null,1,0,0,"","p","p",0]
["",0,0,0,0,null,null,null,null,null,"",{"$error":"#VALUE!"},"",{"$error":"#VALUE!"},"",{"$error":"#VALUE!"},"","","",{"$f":"IF(V541>0,COUNTIF(Q$7:Q541,\"=\"&Q541)-1,\"\")","v":""},"",0,0,0,0,0,0,0,0,0,0,0,0,0,0,0,0,0,0,0,0,0,0,0,0,0,0,0,0,0,0,0,0,0,0,0,0,0,0,0,0,0,0,0,0,0,0,0,0,0,0,0,0,0,0,0,0,0,0,0,0,0,0,0,0,0,0,0,0,0,0,0,0,0,0,0,0,0,0,0,null,1,0,0,"","p","p",0]
["",0,0,0,0,null,null,null,null,null,"",{"$error":"#VALUE!"},"",{"$error":"#VALUE!"},"",{"$error":"#VALUE!"},"","","",{"$f":"IF(V542>0,COUNTIF(Q$7:Q542,\"=\"&Q542)-1,\"\")","v":""},"",0,0,0,0,0,0,0,0,0,0,0,0,0,0,0,0,0,0,0,0,0,0,0,0,0,0,0,0,0,0,0,0,0,0,0,0,0,0,0,0,0,0,0,0,0,0,0,0,0,0,0,0,0,0,0,0,0,0,0,0,0,0,0,0,0,0,0,0,0,0,0,0,0,0,0,0,0,0,0,null,1,0,0,"","p","p",0]
["",0,0,0,0,null,null,null,null,null,"",{"$error":"#VALUE!"},"",{"$error":"#VALUE!"},"",{"$error":"#VALUE!"},"","","",{"$f":"IF(V543>0,COUNTIF(Q$7:Q543,\"=\"&Q543)-1,\"\")","v":""},"",0,0,0,0,0,0,0,0,0,0,0,0,0,0,0,0,0,0,0,0,0,0,0,0,0,0,0,0,0,0,0,0,0,0,0,0,0,0,0,0,0,0,0,0,0,0,0,0,0,0,0,0,0,0,0,0,0,0,0,0,0,0,0,0,0,0,0,0,0,0,0,0,0,0,0,0,0,0,0,null,1,0,0,"","p","p",0]
["",0,0,0,0,null,null,null,null,null,"",{"$error":"#VALUE!"},"",{"$error":"#VALUE!"},"",{"$error":"#VALUE!"},"","","",{"$f":"IF(V544>0,COUNTIF(Q$7:Q544,\"=\"&Q544)-1,\"\")","v":""},"",0,0,0,0,0,0,0,0,0,0,0,0,0,0,0,0,0,0,0,0,0,0,0,0,0,0,0,0,0,0,0,0,0,0,0,0,0,0,0,0,0,0,0,0,0,0,0,0,0,0,0,0,0,0,0,0,0,0,0,0,0,0,0,0,0,0,0,0,0,0,0,0,0,0,0,0,0,0,0,null,1,0,0,"","p","p",0]
["",0,0,0,0,null,null,null,null,null,"",{"$error":"#VALUE!"},"",{"$error":"#VALUE!"},"",{"$error":"#VALUE!"},"","","",{"$f":"IF(V545>0,COUNTIF(Q$7:Q545,\"=\"&Q545)-1,\"\")","v":""},"",0,0,0,0,0,0,0,0,0,0,0,0,0,0,0,0,0,0,0,0,0,0,0,0,0,0,0,0,0,0,0,0,0,0,0,0,0,0,0,0,0,0,0,0,0,0,0,0,0,0,0,0,0,0,0,0,0,0,0,0,0,0,0,0,0,0,0,0,0,0,0,0,0,0,0,0,0,0,0,null,1,0,0,"","p","p",0]
["",0,0,0,0,null,null,null,null,null,"",{"$error":"#VALUE!"},"",{"$error":"#VALUE!"},"",{"$error":"#VALUE!"},"","","",{"$f":"IF(V546>0,COUNTIF(Q$7:Q546,\"=\"&Q546)-1,\"\")","v":""},"",0,0,0,0,0,0,0,0,0,0,0,0,0,0,0,0,0,0,0,0,0,0,0,0,0,0,0,0,0,0,0,0,0,0,0,0,0,0,0,0,0,0,0,0,0,0,0,0,0,0,0,0,0,0,0,0,0,0,0,0,0,0,0,0,0,0,0,0,0,0,0,0,0,0,0,0,0,0,0,null,1,0,0,"","p","p",0]
["",0,0,0,0,null,null,null,null,null,"",{"$error":"#VALUE!"},"",{"$error":"#VALUE!"},"",{"$error":"#VALUE!"},"","","",{"$f":"IF(V547>0,COUNTIF(Q$7:Q547,\"=\"&Q547)-1,\"\")","v":""},"",0,0,0,0,0,0,{"$f":"IF($CZ547>0,$V547-LEN(SUBSTITUTE($J547,AB$4,\"\")),0)","v":0},0,0,0,0,0,0,0,0,0,{"$f":"IF($CZ547>0,$V547-LEN(SUBSTITUTE($J547,AL$4,\"\")),0)","v":0},0,0,0,0,0,0,0,0,0,{"$f":"IF($CZ547>0,$V547-LEN(SUBSTITUTE($J547,AV$4,\"\")),0)","v":0},0,0,0,0,0,0,0,0,0,0,0,0,{"$f":"IF($CZ547>0,$V547-LEN(SUBSTITUTE($J547,BI$4,\"\")),0)","v":0},0,0,0,0,0,0,0,0,0,{"$f":"IF($CZ547>0,$V547-LEN(SUBSTITUTE($J547,BS$4,\"\")),0)","v":0},0,0,0,0,0,0,0,0,0,{"$f":"IF($CZ547>0,$V547-LEN(SUBSTITUTE($J547,CC$4,\"\")),0)","v":0},0,0,0,0,0,0,0,0,0,0,{"$f":"IF($CZ547>0,$V547-LEN(SUBSTITUTE($J547,CN$4,\"\")),0)","v":0},0,0,0,0,0,0,0,0,null,1,0,0,"","p","p",0]
["",0,0,0,0,null,null,null,null,null,"",{"$error":"#VALUE!"},"",{"$error":"#VALUE!"},"",{"$error":"#VALUE!"},"","","",{"$f":"IF(V548>0,COUNTIF(Q$7:Q548,\"=\"&Q548)-1,\"\")","v":""},"",0,0,0,0,0,0,0,0,0,0,0,0,0,0,0,0,0,0,0,0,0,0,0,0,0,0,0,0,0,0,0,0,0,0,0,0,0,0,0,0,0,0,0,0,0,0,0,0,0,0,0,0,0,0,0,0,0,0,0,0,0,0,0,0,0,0,0,0,0,0,0,0,0,0,0,0,0,0,0,null,1,0,0,"","p","p",0]
["",0,0,0,0,null,null,null,null,null,"",{"$error":"#VALUE!"},"",{"$error":"#VALUE!"},"",{"$error":"#VALUE!"},"","","",{"$f":"IF(V549>0,COUNTIF(Q$7:Q549,\"=\"&Q549)-1,\"\")","v":""},"",0,0,0,0,0,0,0,0,0,0,0,0,0,0,0,0,0,0,0,0,0,0,0,0,0,0,0,0,0,0,0,0,0,0,0,0,0,0,0,0,0,0,0,0,0,0,0,0,0,0,0,0,0,0,0,0,0,0,0,0,0,0,0,0,0,0,0,0,0,0,0,0,0,0,0,0,0,0,0,null,1,0,0,"","p","p",0]
["",0,0,0,0,null,null,null,null,null,"",{"$error":"#VALUE!"},"",{"$error":"#VALUE!"},"",{"$error":"#VALUE!"},"","","",{"$f":"IF(V550>0,COUNTIF(Q$7:Q550,\"=\"&Q550)-1,\"\")","v":""},"",0,0,0,0,0,0,0,0,0,0,0,0,0,0,0,0,0,0,0,0,0,0,0,0,0,0,0,0,0,0,0,0,0,0,0,0,0,0,0,0,0,0,0,0,0,0,0,0,0,0,0,0,0,0,0,0,0,0,0,0,0,0,0,0,0,0,0,0,0,0,0,0,0,0,0,0,0,0,0,null,1,0,0,"","p","p",0]
["",0,0,0,0,null,null,null,null,null,"",{"$error":"#VALUE!"},"",{"$error":"#VALUE!"},"",{"$error":"#VALUE!"},"","","",{"$f":"IF(V551>0,COUNTIF(Q$7:Q551,\"=\"&Q551)-1,\"\")","v":""},"",0,0,0,0,0,0,0,0,0,0,0,0,0,0,0,0,0,0,0,0,0,0,0,0,0,0,0,0,0,0,0,0,0,0,0,0,0,0,0,0,0,0,0,0,0,0,0,0,0,0,0,0,0,0,0,0,0,0,0,0,0,0,0,0,0,0,0,0,0,0,0,0,0,0,{"$f":"IF($CZ551>0,$V551-LEN(SUBSTITUTE($J551,CR$4,\"\")),0)","v":0},0,0,0,0,null,1,0,0,"","p","p",0]
[{"$f":"IF(V552=0,\"\",A551+1)","v":""},0,0,0,0,null,null,null,null,null,{"$f":"IF(V552=0,\"\",SUMPRODUCT(W$5:CY$5,W552:CY552))","v":""},{"$f":"IF(C552=-1,\"\",K552-18.01528)","v":{"$error":"#VALUE!"}},{"$f":"IF(V552=0,\"\",SUMPRODUCT(W$6:CY$6,W552:CY552))","v":""},{"$f":"IF(C552=-1,\"\",M552-18.0105646861)","v":{"$error":"#VALUE!"}},{"$f":"IF(V552=0,\"\",M552+TRUNC(K552-M552-0.1))","v":""},{"$f":"IF(C552=-1,\"\",O552-18.0105646861)","v":{"$error":"#VALUE!"}},{"$f":"IF(V552>0,ROUND(K552,4),\"\")","v":""},{"$f":"IF(V552>0,S552+T552,\"\")","v":""},"",{"$f":"IF(V552>0,COUNTIF(Q$7:Q552,\"=\"&Q552)-1,\"\")","v":""},{"$f":"IF(V552>0,$R$6-R552+1,\"\")","v":""},{"$f":"LEN(J552)","v":0},0,0,0,0,0,0,0,0,0,0,0,0,0,0,0,0,0,0,0,0,0,0,0,0,0,0,0,0,0,0,0,0,0,0,0,0,0,{"$f":"IF($CZ552>0,$V552-LEN(SUBSTITUTE($J552,BH$4,\"\")),0)+DD552","v":0},0,0,0,0,0,0,0,0,0,0,0,0,0,0,0,0,0,0,0,0,0,0,0,0,0,0,0,0,0,0,0,0,0,0,0,0,0,0,0,{"$f":"V552+B552+C552","v":0},null,{"$f":"-(V552-1)+D552","v":1},{"$f":"E552","v":0},0,{"$f":"IF($B552=0,\"\",IF(F552=1,LEFT($B$2,LEN($B$2)-1),LEFT($B$3,LEN($B$3)-1)))","v":""},"p",{"$f":"DA552&J552&DB552","v":"p"},0]
["",0,0,0,0,null,null,null,null,null,"",{"$error":"#VALUE!"},"",{"$error":"#VALUE!"},"",{"$error":"#VALUE!"},"","","",{"$f":"IF(V553>0,COUNTIF(Q$7:Q553,\"=\"&Q553)-1,\"\")","v":""},"",0,0,0,0,0,0,0,0,0,0,0,0,0,0,0,0,0,0,0,0,0,0,0,0,0,0,0,0,0,0,0,0,0,0,0,0,0,0,0,0,0,0,0,0,0,0,0,0,0,0,0,0,0,0,0,0,0,0,0,0,0,0,0,0,0,0,0,0,0,0,0,0,0,0,0,0,0,0,0,null,1,0,0,"","p","p",0]
["",0,0,0,0,null,null,null,null,null,"",{"$error":"#VALUE!"},"",{"$error":"#VALUE!"},"",{"$error":"#VALUE!"},"","","",{"$f":"IF(V554>0,COUNTIF(Q$7:Q554,\"=\"&Q554)-1,\"\")","v":""},"",0,0,0,0,0,0,0,0,0,0,0,0,0,0,0,0,0,0,0,0,0,0,0,0,0,0,0,0,0,0,0,0,0,0,0,0,0,0,0,0,0,0,0,0,0,0,0,0,0,0,0,0,0,0,0,0,0,0,0,0,0,0,0,0,0,0,0,0,0,0,0,0,0,0,0,0,0,0,0,null,1,0,0,"","p","p",0]
["",0,0,0,0,null,null,null,null,null,"",{"$error":"#VALUE!"},"",{"$error":"#VALUE!"},"",{"$error":"#VALUE!"},"","","",{"$f":"IF(V555>0,COUNTIF(Q$7:Q555,\"=\"&Q555)-1,\"\")","v":""},"",0,0,0,0,0,0,0,0,0,0,0,0,0,0,0,0,0,0,0,0,0,0,0,0,0,0,0,0,0,0,0,0,0,0,0,0,0,0,0,0,0,0,0,0,0,0,0,0,0,0,0,0,0,0,0,0,0,0,0,0,0,0,0,0,0,0,0,0,0,0,0,0,0,0,0,0,0,0,0,null,1,0,0,"","p","p",0]
["",0,0,0,0,null,null,null,null,null,"",{"$error":"#VALUE!"},"",{"$error":"#VALUE!"},"",{"$error":"#VALUE!"},"","","",{"$f":"IF(V556>0,COUNTIF(Q$7:Q556,\"=\"&Q556)-1,\"\")","v":""},"",0,0,0,0,0,0,0,0,0,0,0,0,0,0,0,0,0,0,0,0,0,0,0,0,0,0,0,0,0,0,0,0,0,0,0,0,0,0,0,0,0,0,0,0,0,0,0,0,0,0,0,0,0,0,0,0,0,0,0,0,0,0,0,0,0,0,0,0,0,0,0,0,0,0,0,0,0,0,0,null,1,0,0,"","p","p",0]
["",0,0,0,0,null,null,null,null,null,"",{"$error":"#VALUE!"},"",{"$error":"#VALUE!"},"",{"$error":"#VALUE!"},"","","",{"$f":"IF(V557>0,COUNTIF(Q$7:Q557,\"=\"&Q557)-1,\"\")","v":""},"",0,0,0,0,0,0,{"$f":"IF($CZ557>0,$V557-LEN(SUBSTITUTE($J557,AB$4,\"\")),0)","v":0},0,0,0,0,0,0,0,0,0,{"$f":"IF($CZ557>0,$V557-LEN(SUBSTITUTE($J557,AL$4,\"\")),0)","v":0},0,0,0,0,0,0,0,0,0,{"$f":"IF($CZ557>0,$V557-LEN(SUBSTITUTE($J557,AV$4,\"\")),0)","v":0},0,0,0,0,0,0,0,0,0,0,0,0,{"$f":"IF($CZ557>0,$V557-LEN(SUBSTITUTE($J557,BI$4,\"\")),0)","v":0},0,0,0,0,0,0,0,0,0,{"$f":"IF($CZ557>0,$V557-LEN(SUBSTITUTE($J557,BS$4,\"\")),0)","v":0},0,0,0,0,0,0,0,0,0,{"$f":"IF($CZ557>0,$V557-LEN(SUBSTITUTE($J557,CC$4,\"\")),0)","v":0},0,0,0,0,0,0,0,0,0,0,0,0,0,0,0,0,0,0,0,null,1,0,0,"","p","p",0]
["",0,0,0,0,null,null,null,null,null,"",{"$error":"#VALUE!"},"",{"$error":"#VALUE!"},"",{"$error":"#VALUE!"},"","","",{"$f":"IF(V558>0,COUNTIF(Q$7:Q558,\"=\"&Q558)-1,\"\")","v":""},"",0,0,0,0,0,0,0,0,0,0,0,0,0,0,0,0,0,0,0,0,0,0,0,0,0,0,0,0,0,0,0,0,0,0,0,0,0,0,0,0,0,0,0,0,0,0,0,0,0,0,0,0,0,0,0,0,0,0,0,0,0,0,0,0,0,0,0,0,0,0,0,0,0,0,0,0,0,0,0,null,1,0,0,"","p","p",0]
["",0,0,0,0,null,null,null,null,null,"",{"$error":"#VALUE!"},"",{"$error":"#VALUE!"},"",{"$error":"#VALUE!"},"","","",{"$f":"IF(V559>0,COUNTIF(Q$7:Q559,\"=\"&Q559)-1,\"\")","v":""},"",0,0,0,0,0,0,0,0,0,0,0,0,0,0,0,0,0,0,0,0,0,0,0,0,0,0,0,0,0,0,0,0,0,0,0,0,0,0,0,0,0,0,0,0,0,0,0,0,0,0,0,0,0,0,0,0,0,0,0,0,0,0,0,0,0,0,0,0,0,0,0,0,0,0,0,0,0,0,0,null,1,0,0,"","p","p",0]
["",0,0,0,0,null,null,null,null,null,"",{"$error":"#VALUE!"},"",{"$error":"#VALUE!"},"",{"$error":"#VALUE!"},"","","",{"$f":"IF(V560>0,COUNTIF(Q$7:Q560,\"=\"&Q560)-1,\"\")","v":""},"",0,0,0,0,0,0,0,0,0,0,0,0,0,0,0,0,0,0,0,0,0,0,0,0,0,0,0,0,0,0,0,0,0,0,0,0,0,0,0,0,0,0,0,0,0,0,0,0,0,0,0,0,0,0,0,0,0,0,0,0,0,0,0,0,0,0,0,0,0,0,0,0,0,0,0,0,0,0,0,null,1,0,0,"","p","p",0]
["",0,0,0,0,null,null,null,null,null,"",{"$error":"#VALUE!"},"",{"$error":"#VALUE!"},"",{"$error":"#VALUE!"},"","","",{"$f":"IF(V561>0,COUNTIF(Q$7:Q561,\"=\"&Q561)-1,\"\")","v":""},"",0,0,0,0,0,0,0,0,0,0,0,0,0,0,0,0,0,0,0,0,0,0,0,0,0,0,0,0,0,0,0,0,0,0,0,0,0,0,0,0,0,0,0,0,0,0,0,0,0,0,0,0,0,0,0,0,0,0,0,0,0,0,0,0,0,0,0,0,0,0,0,0,0,0,0,0,0,0,0,null,1,0,0,"","p","p",0]
["",0,0,0,0,null,null,null,null,null,"",{"$error":"#VALUE!"},"",{"$error":"#VALUE!"},"",{"$error":"#VALUE!"},"","","",{"$f":"IF(V562>0,COUNTIF(Q$7:Q562,\"=\"&Q562)-1,\"\")","v":""},"",0,0,0,0,0,0,0,0,0,0,0,0,0,0,0,0,0,0,0,0,0,0,0,0,0,0,0,0,0,0,0,0,0,0,0,0,0,0,0,0,0,0,0,0,0,0,0,0,0,0,0,0,0,0,0,0,0,0,0,0,0,0,0,0,0,0,0,0,0,0,0,0,0,0,0,0,0,0,0,null,1,0,0,"","p","p",0]
["",0,0,0,0,null,null,null,null,null,"",{"$error":"#VALUE!"},"",{"$error":"#VALUE!"},"",{"$error":"#VALUE!"},"","","",{"$f":"IF(V563>0,COUNTIF(Q$7:Q563,\"=\"&Q563)-1,\"\")","v":""},"",0,0,0,0,0,0,0,0,0,0,0,0,0,0,0,0,0,0,0,0,0,0,0,0,0,0,0,0,0,0,0,0,0,0,0,0,0,0,0,0,0,0,0,0,0,0,0,0,0,0,0,0,0,0,0,0,0,0,0,0,0,0,0,0,0,0,0,0,0,0,0,0,0,0,0,0,0,0,0,null,1,0,0,"","p","p",0]
["",0,0,0,0,null,null,null,null,null,"",{"$error":"#VALUE!"},"",{"$error":"#VALUE!"},"",{"$error":"#VALUE!"},"","","",{"$f":"IF(V564>0,COUNTIF(Q$7:Q564,\"=\"&Q564)-1,\"\")","v":""},"",0,0,0,0,0,0,0,0,0,0,0,0,0,0,0,0,0,0,0,0,0,0,0,0,0,0,0,0,0,0,0,0,0,0,0,0,0,0,0,0,0,0,0,0,0,0,0,0,0,0,0,0,0,0,0,0,0,0,0,0,0,0,0,0,0,0,0,0,0,0,0,0,0,0,0,0,0,0,0,null,1,0,0,"","p","p",0]
["",0,0,0,0,null,null,null,null,null,"",{"$error":"#VALUE!"},"",{"$error":"#VALUE!"},"",{"$error":"#VALUE!"},"","","",{"$f":"IF(V565>0,COUNTIF(Q$7:Q565,\"=\"&Q565)-1,\"\")","v":""},"",0,0,0,0,0,0,0,0,0,0,0,0,0,0,0,0,0,0,0,0,0,0,0,0,0,0,0,0,0,0,0,0,0,0,0,0,0,0,0,0,0,0,0,0,0,0,0,0,0,0,0,0,0,0,0,0,0,0,0,0,0,0,0,0,0,0,0,0,0,0,0,0,0,0,0,0,0,0,0,null,1,0,0,"","p","p",0]
["",0,0,0,0,null,null,null,null,null,"",{"$error":"#VALUE!"},"",{"$error":"#VALUE!"},"",{"$error":"#VALUE!"},"","","",{"$f":"IF(V566>0,COUNTIF(Q$7:Q566,\"=\"&Q566)-1,\"\")","v":""},"",0,0,0,0,0,0,0,0,0,0,0,0,0,0,0,0,0,0,0,0,0,0,0,0,0,0,0,0,0,0,0,0,0,0,0,0,0,0,0,0,0,0,0,0,0,0,0,0,0,0,0,0,0,0,0,0,0,0,0,0,0,0,0,0,0,0,0,0,0,0,0,0,0,0,0,0,0,0,0,null,1,0,0,"","p","p",0]
["",0,0,0,0,null,null,null,null,null,"",{"$error":"#VALUE!"},"",{"$error":"#VALUE!"},"",{"$error":"#VALUE!"},"","","",{"$f":"IF(V567>0,COUNTIF(Q$7:Q567,\"=\"&Q567)-1,\"\")","v":""},"",0,0,0,0,0,0,{"$f":"IF($CZ567>0,$V567-LEN(SUBSTITUTE($J567,AB$4,\"\")),0)","v":0},0,0,0,0,0,0,0,0,0,{"$f":"IF($CZ567>0,$V567-LEN(SUBSTITUTE($J567,AL$4,\"\")),0)","v":0},0,0,0,0,0,0,0,0,0,{"$f":"IF($CZ567>0,$V567-LEN(SUBSTITUTE($J567,AV$4,\"\")),0)","v":0},0,0,0,0,0,0,0,0,0,0,0,0,{"$f":"IF($CZ567>0,$V567-LEN(SUBSTITUTE($J567,BI$4,\"\")),0)","v":0},0,0,0,0,0,0,0,0,0,{"$f":"IF($CZ567>0,$V567-LEN(SUBSTITUTE($J567,BS$4,\"\")),0)","v":0},0,0,0,0,0,0,0,0,0,{"$f":"IF($CZ567>0,$V567-LEN(SUBSTITUTE($J567,CC$4,\"\")),0)","v":0},0,0,0,0,0,0,0,0,0,0,{"$f":"IF($CZ567>0,$V567-LEN(SUBSTITUTE($J567,CN$4,\"\")),0)","v":0},0,0,0,{"$f":"IF($CZ567>0,$V567-LEN(SUBSTITUTE($J567,CR$4,\"\")),0)","v":0},0,0,0,0,null,1,0,0,"","p","p",0]
["",0,0,0,0,null,null,null,null,null,"",{"$error":"#VALUE!"},"",{"$error":"#VALUE!"},"",{"$error":"#VALUE!"},"","","",{"$f":"IF(V568>0,COUNTIF(Q$7:Q568,\"=\"&Q568)-1,\"\")","v":""},"",0,0,0,0,0,0,0,0,0,0,0,0,0,0,0,0,0,0,0,0,0,0,0,0,0,0,0,0,0,0,0,0,0,0,0,0,0,0,0,0,0,0,0,0,0,0,0,0,0,0,0,0,0,0,0,0,0,0,0,0,0,0,0,0,0,0,0,0,0,0,0,0,0,0,0,0,0,0,0,null,1,0,0,"","p","p",0]
["",0,0,0,0,null,null,null,null,null,"",{"$error":"#VALUE!"},"",{"$error":"#VALUE!"},"",{"$error":"#VALUE!"},"","","",{"$f":"IF(V569>0,COUNTIF(Q$7:Q569,\"=\"&Q569)-1,\"\")","v":""},"",0,0,0,0,0,0,0,0,0,0,0,0,0,0,0,0,0,0,0,0,0,0,0,0,0,0,0,0,0,0,0,0,0,0,0,0,0,0,0,0,0,0,0,0,0,0,0,0,0,0,0,0,0,0,0,0,0,0,0,0,0,0,0,0,0,0,0,0,0,0,0,0,0,0,0,0,0,0,0,null,1,0,0,"","p","p",0]
["",0,0,0,0,null,null,null,null,null,"",{"$error":"#VALUE!"},"",{"$error":"#VALUE!"},"",{"$error":"#VALUE!"},"","","",{"$f":"IF(V570>0,COUNTIF(Q$7:Q570,\"=\"&Q570)-1,\"\")","v":""},"",0,0,0,0,0,0,0,0,0,0,0,0,0,0,0,0,0,0,0,0,0,0,0,0,0,0,0,0,0,0,0,0,0,0,0,0,0,0,0,0,0,0,0,0,0,0,0,0,0,0,0,0,0,0,0,0,0,0,0,0,0,0,0,0,0,0,0,0,0,0,0,0,0,0,0,0,0,0,0,null,1,0,0,"","p","p",0]
["",0,0,0,0,null,null,null,null,null,"",{"$error":"#VALUE!"},"",{"$error":"#VALUE!"},"",{"$error":"#VALUE!"},"","","",{"$f":"IF(V571>0,COUNTIF(Q$7:Q571,\"=\"&Q571)-1,\"\")","v":""},"",0,0,0,0,0,0,0,0,0,0,0,0,0,0,0,0,0,0,0,0,0,0,0,0,0,0,0,0,0,0,0,0,0,0,0,0,0,0,0,0,0,0,0,0,0,0,0,0,0,0,0,0,0,0,0,0,0,0,0,0,0,0,0,0,0,0,0,0,0,0,0,0,0,0,0,0,0,0,0,null,1,0,0,"","p","p",0]
["",0,0,0,0,null,null,null,null,null,"",{"$error":"#VALUE!"},"",{"$error":"#VALUE!"},"",{"$error":"#VALUE!"},"","","",{"$f":"IF(V572>0,COUNTIF(Q$7:Q572,\"=\"&Q572)-1,\"\")","v":""},"",0,0,0,0,0,0,0,0,0,0,0,0,0,0,0,0,0,0,0,0,0,0,0,0,0,0,0,0,0,0,0,0,0,0,0,0,0,0,0,0,0,0,0,0,0,0,0,0,0,0,0,0,0,0,0,0,0,0,0,0,0,0,0,0,0,0,0,0,0,0,0,0,0,0,0,0,0,0,0,null,1,0,0,"","p","p",0]
["",0,0,0,0,null,null,null,null,null,"",{"$error":"#VALUE!"},"",{"$error":"#VALUE!"},"",{"$error":"#VALUE!"},"","","",{"$f":"IF(V573>0,COUNTIF(Q$7:Q573,\"=\"&Q573)-1,\"\")","v":""},"",0,{"$f":"$V573-LEN(SUBSTITUTE($J573,W$4,\"\"))","v":0},0,0,0,0,0,0,0,0,0,0,0,0,0,0,0,0,0,0,0,0,0,0,0,0,0,0,0,0,0,0,0,0,0,0,0,0,0,0,0,0,0,0,0,0,0,0,0,0,0,0,0,0,0,0,0,0,0,0,0,0,0,0,0,0,0,0,0,0,0,0,0,0,0,0,0,0,0,null,1,0,0,"","p","p",0]
["",0,0,0,0,null,null,null,null,null,"",{"$error":"#VALUE!"},"",{"$error":"#VALUE!"},"",{"$error":"#VALUE!"},"","","",{"$f":"IF(V574>0,COUNTIF(Q$7:Q574,\"=\"&Q574)-1,\"\")","v":""},"",0,0,0,0,0,0,0,0,0,0,0,0,0,0,0,0,0,0,0,0,0,0,0,0,0,0,0,0,0,0,0,0,0,0,0,0,0,0,0,0,0,0,0,0,0,0,0,0,0,0,0,0,0,0,0,0,0,0,0,0,0,0,0,0,0,0,0,0,0,0,0,0,0,0,0,0,0,0,0,null,1,0,0,"","p","p",0]
["",0,0,0,0,null,null,null,null,null,"",{"$error":"#VALUE!"},"",{"$error":"#VALUE!"},"",{"$error":"#VALUE!"},"","","",{"$f":"IF(V575>0,COUNTIF(Q$7:Q575,\"=\"&Q575)-1,\"\")","v":""},"",0,0,0,0,0,0,0,0,0,0,0,0,0,0,0,0,0,0,0,0,0,0,0,0,0,0,0,0,0,0,0,0,0,0,0,0,0,0,0,0,0,0,0,0,0,0,0,0,0,0,0,0,0,0,0,0,0,0,0,0,0,0,0,0,0,0,0,0,0,0,0,0,0,0,0,0,0,0,0,null,1,0,0,"","p","p",0]
["",0,0,0,0,null,null,null,null,null,"",{"$error":"#VALUE!"},"",{"$error":"#VALUE!"},"",{"$error":"#VALUE!"},"","","",{"$f":"IF(V576>0,COUNTIF(Q$7:Q576,\"=\"&Q576)-1,\"\")","v":""},"",0,0,0,0,0,0,0,0,0,0,0,0,0,0,0,0,0,0,0,0,0,0,0,0,0,0,0,0,0,0,0,0,0,0,0,0,0,0,0,0,0,0,0,0,0,0,0,0,0,0,0,0,0,0,0,0,0,0,0,0,0,0,0,0,0,0,0,0,0,0,0,0,0,0,0,0,0,0,0,null,1,0,0,"","p","p",0]
["",0,0,0,0,null,null,null,null,null,"",{"$error":"#VALUE!"},"",{"$error":"#VALUE!"},"",{"$error":"#VALUE!"},"","","",{"$f":"IF(V577>0,COUNTIF(Q$7:Q577,\"=\"&Q577)-1,\"\")","v":""},"",0,0,0,0,0,0,{"$f":"IF($CZ577>0,$V577-LEN(SUBSTITUTE($J577,AB$4,\"\")),0)","v":0},0,0,0,0,0,0,0,0,0,{"$f":"IF($CZ577>0,$V577-LEN(SUBSTITUTE($J577,AL$4,\"\")),0)","v":0},0,0,0,0,0,0,0,0,0,{"$f":"IF($CZ577>0,$V577-LEN(SUBSTITUTE($J577,AV$4,\"\")),0)","v":0},0,0,0,0,0,0,0,0,0,0,0,0,{"$f":"IF($CZ577>0,$V577-LEN(SUBSTITUTE($J577,BI$4,\"\")),0)","v":0},0,0,0,0,0,0,0,0,0,{"$f":"IF($CZ577>0,$V577-LEN(SUBSTITUTE($J577,BS$4,\"\")),0)","v":0},0,0,0,0,0,0,0,0,0,{"$f":"IF($CZ577>0,$V577-LEN(SUBSTITUTE($J577,CC$4,\"\")),0)","v":0},0,0,0,0,0,0,0,0,0,0,0,0,0,0,0,0,0,0,0,null,1,0,0,"","p","p",0]
["",0,0,0,0,null,null,null,null,null,"",{"$error":"#VALUE!"},"",{"$error":"#VALUE!"},"",{"$error":"#VALUE!"},"","","",{"$f":"IF(V578>0,COUNTIF(Q$7:Q578,\"=\"&Q578)-1,\"\")","v":""},"",0,0,0,0,0,0,0,0,0,0,0,0,0,0,0,0,0,0,0,0,0,0,0,0,0,0,0,0,0,0,0,0,0,0,0,0,0,0,0,0,0,0,0,0,0,0,0,0,0,0,0,0,0,0,0,0,0,0,0,0,0,0,0,0,0,0,0,0,0,0,0,0,0,0,0,0,0,0,0,null,1,0,0,"","p","p",0]
["",0,0,0,0,null,null,null,null,null,"",{"$error":"#VALUE!"},"",{"$error":"#VALUE!"},"",{"$error":"#VALUE!"},"","","",{"$f":"IF(V579>0,COUNTIF(Q$7:Q579,\"=\"&Q579)-1,\"\")","v":""},"",0,0,0,0,0,0,0,0,0,0,0,0,0,0,0,0,0,0,0,0,0,0,0,0,0,0,0,0,0,0,0,0,0,0,0,0,0,0,0,0,0,0,0,0,0,0,0,0,0,0,0,0,0,0,0,0,0,0,0,0,0,0,0,0,0,0,0,0,0,0,0,0,0,0,0,0,0,0,0,null,1,0,0,"","p","p",0]
["",0,0,0,0,null,null,null,null,null,"",{"$error":"#VALUE!"},"",{"$error":"#VALUE!"},"",{"$error":"#VALUE!"},"","","",{"$f":"IF(V580>0,COUNTIF(Q$7:Q580,\"=\"&Q580)-1,\"\")","v":""},"",0,0,0,0,0,0,0,0,0,0,0,0,0,0,0,0,0,0,0,0,0,0,0,0,0,0,0,0,0,0,0,0,0,0,0,0,0,0,0,0,0,0,0,0,0,0,0,0,0,0,0,0,0,0,0,0,0,0,0,0,0,0,0,0,0,0,0,0,0,0,0,0,0,0,0,0,0,0,0,null,1,0,0,"","p","p",0]
["",0,0,0,0,null,null,null,null,null,"",{"$error":"#VALUE!"},"",{"$error":"#VALUE!"},"",{"$error":"#VALUE!"},"","","",{"$f":"IF(V581>0,COUNTIF(Q$7:Q581,\"=\"&Q581)-1,\"\")","v":""},"",0,0,0,0,0,0,0,0,0,0,0,0,0,0,0,0,0,0,0,0,0,0,0,0,0,0,0,0,0,0,0,0,0,0,0,0,0,0,0,0,0,0,0,0,0,0,0,0,0,0,0,0,0,0,0,0,0,0,0,0,0,0,0,0,0,0,0,0,0,0,0,0,0,0,0,0,0,0,0,null,1,0,0,"","p","p",0]
["",0,0,0,0,null,null,null,null,null,"",{"$error":"#VALUE!"},"",{"$error":"#VALUE!"},"",{"$error":"#VALUE!"},"","","",{"$f":"IF(V582>0,COUNTIF(Q$7:Q582,\"=\"&Q582)-1,\"\")","v":""},"",0,0,0,0,0,0,0,0,0,0,0,0,0,0,0,0,0,0,0,0,0,0,0,0,0,0,0,0,0,0,0,0,0,0,0,0,0,0,0,0,0,0,0,0,0,0,0,0,0,0,0,0,0,0,0,0,0,0,0,0,0,0,0,0,0,0,0,0,0,0,0,0,0,0,0,0,0,0,0,null,1,0,0,"","p","p",0]
["",0,{"$f":"IF($C$2=\"forced-OH\",-1,IF($G583=1,$C$3,IF($G583=2,$D$3,0)))","v":0},{"$f":"IF($F583=1,VLOOKUP($B$2,$DE$5:$DI$11,5,FALSE),0)","v":0},{"$f":"IF($F583=1,VLOOKUP($B$2,$DE$5:$DG$11,3,FALSE),0)","v":0},null,null,null,null,null,"",{"$error":"#VALUE!"},"",{"$error":"#VALUE!"},"",{"$error":"#VALUE!"},"","",{"$f":"IF(V583>0,COUNTIF(Q$7:Q$651,\"<\"&Q583)+1,\"\")","v":""},{"$f":"IF(V583>0,COUNTIF(Q$7:Q583,\"=\"&Q583)-1,\"\")","v":""},"",0,0,0,0,0,0,0,0,0,0,0,0,0,0,0,0,0,0,0,0,0,0,0,0,0,0,0,0,0,0,0,0,0,0,0,0,0,0,0,0,0,0,0,0,0,0,0,0,0,0,0,0,0,0,0,0,0,0,0,0,0,0,0,0,0,0,0,0,0,0,0,0,0,0,{"$f":"IF($CZ583>0,$V583-LEN(SUBSTITUTE($J583,CR$4,\"\")),0)","v":0},0,0,0,0,null,1,0,{"$f":"$V583-$W583-$X583-$Z583-$AA583","v":0},"",{"$f":"IF($C583=0,\"p\",\"\")","v":"p"},"p",{"$f":"IF($F583=1,VLOOKUP($B$2,$DE$5:$DH$11,4,FALSE),0)","v":0}]
["",{"$f":"IF($F584=1,VLOOKUP($B$2,$DE$5:$DG$11,2,FALSE),IF($F584=2,VLOOKUP($B$3,$DE$5:$DG$6,2,FALSE),0))","v":0},0,0,0,null,null,null,null,null,"",{"$error":"#VALUE!"},"",{"$error":"#VALUE!"},"",{"$error":"#VALUE!"},"","","",{"$f":"IF(V584>0,COUNTIF(Q$7:Q584,\"=\"&Q584)-1,\"\")","v":""},"",0,0,0,0,0,0,0,0,0,0,0,0,0,0,0,0,0,0,0,0,0,0,0,0,0,0,0,0,0,0,0,0,0,0,0,0,0,0,0,0,0,0,0,0,0,0,0,0,0,0,0,0,0,0,0,0,0,0,0,0,0,0,0,0,0,0,0,0,0,0,0,0,0,0,0,0,0,0,0,null,1,0,0,"","p","p",0]
["",0,0,0,0,null,null,null,null,null,"",{"$error":"#VALUE!"},"",{"$error":"#VALUE!"},"",{"$error":"#VALUE!"},"","","",{"$f":"IF(V585>0,COUNTIF(Q$7:Q585,\"=\"&Q585)-1,\"\")","v":""},"",0,0,0,0,0,0,0,0,0,0,0,0,0,0,0,0,0,0,0,0,0,0,0,0,0,0,0,0,0,0,0,0,0,0,0,0,0,0,0,0,0,0,0,0,0,0,0,0,0,0,0,0,0,0,0,0,0,0,0,0,0,0,0,0,0,0,0,0,0,0,0,0,0,0,0,0,0,0,0,null,1,0,0,"","p","p",0]
["",0,0,0,0,null,null,null,null,null,"",{"$error":"#VALUE!"},"",{"$error":"#VALUE!"},"",{"$error":"#VALUE!"},"","","",{"$f":"IF(V586>0,COUNTIF(Q$7:Q586,\"=\"&Q586)-1,\"\")","v":""},"",0,0,0,0,0,0,0,0,0,0,0,0,0,0,0,0,0,0,0,0,0,0,0,0,0,0,0,0,0,0,0,0,0,0,0,0,0,0,0,0,0,0,0,0,0,0,0,0,0,0,0,0,0,0,0,0,0,0,0,0,0,0,0,0,0,0,0,0,0,0,0,0,0,0,0,0,0,0,0,null,1,0,0,"","p","p",0]
["",0,0,0,0,null,null,null,null,null,"",{"$error":"#VALUE!"},"",{"$error":"#VALUE!"},"",{"$error":"#VALUE!"},"","","",{"$f":"IF(V587>0,COUNTIF(Q$7:Q587,\"=\"&Q587)-1,\"\")","v":""},"",0,0,0,0,0,0,{"$f":"IF($CZ587>0,$V587-LEN(SUBSTITUTE($J587,AB$4,\"\")),0)","v":0},0,0,0,0,0,0,0,0,0,{"$f":"IF($CZ587>0,$V587-LEN(SUBSTITUTE($J587,AL$4,\"\")),0)","v":0},0,0,0,0,0,0,0,0,0,{"$f":"IF($CZ587>0,$V587-LEN(SUBSTITUTE($J587,AV$4,\"\")),0)","v":0},0,0,0,0,0,0,0,0,0,0,0,0,{"$f":"IF($CZ587>0,$V587-LEN(SUBSTITUTE($J587,BI$4,\"\")),0)","v":0},0,0,0,0,0,0,0,0,0,{"$f":"IF($CZ587>0,$V587-LEN(SUBSTITUTE($J587,BS$4,\"\")),0)","v":0},0,0,0,0,0,0,0,0,0,{"$f":"IF($CZ587>0,$V587-LEN(SUBSTITUTE($J587,CC$4,\"\")),0)","v":0},0,0,0,0,0,0,0,0,0,0,{"$f":"IF($CZ587>0,$V587-LEN(SUBSTITUTE($J587,CN$4,\"\")),0)","v":0},0,0,0,0,0,0,0,0,null,1,0,0,"","p","p",0]
["",0,0,0,0,null,null,null,null,null,"",{"$error":"#VALUE!"},"",{"$error":"#VALUE!"},"",{"$error":"#VALUE!"},"","","",{"$f":"IF(V588>0,COUNTIF(Q$7:Q588,\"=\"&Q588)-1,\"\")","v":""},"",0,0,0,0,0,0,0,0,0,0,0,0,0,0,0,0,0,0,0,0,0,0,0,0,0,0,0,0,0,0,0,0,0,0,0,0,0,0,0,0,0,0,0,0,0,0,0,0,0,0,0,0,0,0,0,0,0,0,0,0,0,0,0,0,0,0,0,0,0,0,0,0,0,0,0,0,0,0,0,null,1,0,0,"","p","p",0]
["",0,0,0,0,null,null,null,null,null,"",{"$error":"#VALUE!"},"",{"$error":"#VALUE!"},"",{"$error":"#VALUE!"},"","","",{"$f":"IF(V589>0,COUNTIF(Q$7:Q589,\"=\"&Q589)-1,\"\")","v":""},"",0,0,0,0,0,0,0,0,0,0,0,0,0,0,0,0,0,0,0,0,0,0,0,0,0,0,0,0,0,0,0,0,0,0,0,0,0,0,0,0,0,0,0,0,0,0,0,0,0,0,0,0,0,0,0,0,0,0,0,0,0,0,0,0,0,0,0,0,0,0,0,0,0,0,0,0,0,0,0,null,1,0,0,"","p","p",0]
["",0,0,0,0,null,null,null,null,null,"",{"$error":"#VALUE!"},"",{"$error":"#VALUE!"},"",{"$error":"#VALUE!"},"","","",{"$f":"IF(V590>0,COUNTIF(Q$7:Q590,\"=\"&Q590)-1,\"\")","v":""},"",0,0,0,0,0,0,0,0,0,0,0,0,0,0,0,0,0,0,0,0,0,0,0,0,0,0,0,0,0,0,0,0,0,0,0,0,0,0,0,0,0,0,0,0,0,0,0,0,0,0,0,0,0,0,0,0,0,0,0,0,0,0,0,0,0,0,0,0,0,0,0,0,0,0,0,0,0,0,0,null,1,0,0,"","p","p",0]
["",0,0,0,0,null,null,null,null,null,"",{"$error":"#VALUE!"},"",{"$error":"#VALUE!"},"",{"$error":"#VALUE!"},"","","",{"$f":"IF(V591>0,COUNTIF(Q$7:Q591,\"=\"&Q591)-1,\"\")","v":""},"",0,0,0,0,0,0,0,0,0,0,0,0,0,0,0,0,0,0,0,0,0,0,0,0,0,0,0,0,0,0,0,0,0,0,0,0,0,0,0,0,0,0,0,0,0,0,0,0,0,0,0,0,0,0,0,0,0,0,0,0,0,0,0,0,0,0,0,0,0,0,0,0,0,0,0,0,0,0,0,null,1,0,0,"","p","p",0]
["",0,0,0,0,null,null,null,null,null,"",{"$error":"#VALUE!"},"",{"$error":"#VALUE!"},"",{"$error":"#VALUE!"},"","","",{"$f":"IF(V592>0,COUNTIF(Q$7:Q592,\"=\"&Q592)-1,\"\")","v":""},"",0,0,0,0,0,0,0,0,0,0,0,0,0,0,0,0,0,0,0,0,0,0,0,0,0,0,0,0,0,0,0,0,0,0,0,0,0,0,0,0,0,0,0,0,0,0,0,0,0,0,0,0,0,0,0,0,0,0,0,0,0,0,0,0,0,0,0,0,0,0,0,0,0,0,0,0,0,0,0,null,1,0,0,"","p","p",0]
["",0,0,0,0,null,null,null,null,null,"",{"$error":"#VALUE!"},"",{"$error":"#VALUE!"},"",{"$error":"#VALUE!"},"","","",{"$f":"IF(V593>0,COUNTIF(Q$7:Q593,\"=\"&Q593)-1,\"\")","v":""},"",0,0,0,0,0,0,0,0,0,0,0,0,0,0,0,0,0,0,0,0,0,0,0,0,0,0,0,0,0,0,0,0,0,0,0,0,0,0,0,0,0,0,0,0,0,0,0,0,0,0,0,0,0,0,0,0,0,0,0,0,0,0,0,0,0,0,0,0,0,0,0,0,0,0,0,0,0,0,0,null,1,0,0,"","p","p",0]
["",0,0,0,0,null,null,null,null,null,"",{"$error":"#VALUE!"},"",{"$error":"#VALUE!"},"",{"$error":"#VALUE!"},"","","",{"$f":"IF(V594>0,COUNTIF(Q$7:Q594,\"=\"&Q594)-1,\"\")","v":""},"",0,0,0,0,0,0,0,0,0,0,0,0,0,0,0,0,0,0,0,0,0,0,0,0,0,0,0,0,0,0,0,0,0,0,0,0,0,0,0,0,0,0,0,0,0,0,0,0,0,0,0,0,0,0,0,0,0,0,0,0,0,0,0,0,0,0,0,0,0,0,0,0,0,0,0,0,0,0,0,null,1,0,0,"","p","p",0]
["",0,0,0,0,null,null,null,null,null,"",{"$error":"#VALUE!"},"",{"$error":"#VALUE!"},"",{"$error":"#VALUE!"},"","","",{"$f":"IF(V595>0,COUNTIF(Q$7:Q595,\"=\"&Q595)-1,\"\")","v":""},"",0,0,0,0,0,0,0,0,0,0,0,0,0,0,0,0,0,0,0,0,0,0,0,0,0,0,0,0,0,0,0,0,0,0,0,0,0,0,0,0,0,0,0,0,0,0,0,0,0,0,0,0,0,0,0,0,0,0,0,0,0,0,0,0,0,0,0,0,0,0,0,0,0,0,0,0,0,0,0,null,1,0,0,"","p","p",0]
["",0,0,0,0,null,null,null,null,null,"",{"$error":"#VALUE!"},"",{"$error":"#VALUE!"},"",{"$error":"#VALUE!"},"","","",{"$f":"IF(V596>0,COUNTIF(Q$7:Q596,\"=\"&Q596)-1,\"\")","v":""},"",0,0,0,0,0,0,0,0,0,0,0,0,0,0,0,0,0,0,0,0,0,0,0,0,0,0,0,0,0,0,0,0,0,0,0,0,0,0,0,0,0,0,0,0,0,0,0,0,0,0,0,0,0,0,0,0,0,0,0,0,0,0,0,0,0,0,0,0,0,0,0,0,0,0,0,0,0,0,0,null,1,0,0,"","p","p",0]
["",0,0,0,0,null,null,null,null,null,"",{"$error":"#VALUE!"},"",{"$error":"#VALUE!"},"",{"$error":"#VALUE!"},"","","",{"$f":"IF(V597>0,COUNTIF(Q$7:Q597,\"=\"&Q597)-1,\"\")","v":""},"",0,0,0,0,0,0,{"$f":"IF($CZ597>0,$V597-LEN(SUBSTITUTE($J597,AB$4,\"\")),0)","v":0},0,0,0,0,0,0,0,0,0,{"$f":"IF($CZ597>0,$V597-LEN(SUBSTITUTE($J597,AL$4,\"\")),0)","v":0},0,0,0,0,0,0,0,0,0,{"$f":"IF($CZ597>0,$V597-LEN(SUBSTITUTE($J597,AV$4,\"\")),0)","v":0},0,0,0,0,0,0,0,0,0,0,0,0,{"$f":"IF($CZ597>0,$V597-LEN(SUBSTITUTE($J597,BI$4,\"\")),0)","v":0},0,0,0,0,0,0,0,0,0,{"$f":"IF($CZ597>0,$V597-LEN(SUBSTITUTE($J597,BS$4,\"\")),0)","v":0},0,0,0,0,0,0,0,0,0,{"$f":"IF($CZ597>0,$V597-LEN(SUBSTITUTE($J597,CC$4,\"\")),0)","v":0},0,0,0,0,0,0,0,0,0,0,0,0,0,0,0,0,0,0,0,null,1,0,0,"","p","p",0]
["",0,0,0,0,null,null,null,null,null,"",{"$error":"#VALUE!"},"",{"$error":"#VALUE!"},"",{"$error":"#VALUE!"},"","","",{"$f":"IF(V598>0,COUNTIF(Q$7:Q598,\"=\"&Q598)-1,\"\")","v":""},"",0,0,0,0,0,0,0,0,0,0,0,0,0,0,0,0,0,0,0,0,0,0,0,0,0,0,0,0,0,0,0,0,0,0,0,0,0,0,0,0,0,0,0,0,0,0,0,0,0,0,0,0,0,0,0,0,0,0,0,0,0,0,0,0,0,0,0,0,0,0,0,0,0,0,0,0,0,0,0,null,1,0,0,"","p","p",0]
["",0,0,0,0,null,null,null,null,null,"",{"$error":"#VALUE!"},"",{"$error":"#VALUE!"},"",{"$error":"#VALUE!"},"","","",{"$f":"IF(V599>0,COUNTIF(Q$7:Q599,\"=\"&Q599)-1,\"\")","v":""},"",0,0,0,0,0,0,0,0,0,0,0,0,0,0,0,0,0,0,0,0,0,0,0,0,0,0,0,0,0,0,0,0,0,0,0,0,0,0,0,0,0,0,0,0,0,0,0,0,0,0,0,0,0,0,0,0,0,0,0,0,0,0,0,0,0,0,0,0,0,0,0,0,0,0,{"$f":"IF($CZ599>0,$V599-LEN(SUBSTITUTE($J599,CR$4,\"\")),0)","v":0},0,0,0,0,null,1,0,0,"","p","p",0]
["",0,0,0,0,null,null,null,null,null,"",{"$error":"#VALUE!"},"",{"$error":"#VALUE!"},"",{"$error":"#VALUE!"},"","","",{"$f":"IF(V600>0,COUNTIF(Q$7:Q600,\"=\"&Q600)-1,\"\")","v":""},"",0,0,0,0,0,0,0,0,0,0,0,0,0,0,0,0,0,0,0,0,0,0,0,0,0,0,0,0,0,0,0,0,0,0,0,0,0,0,0,0,0,0,0,0,0,0,0,0,0,0,0,0,0,0,0,0,0,0,0,0,0,0,0,0,0,0,0,0,0,0,0,0,0,0,0,0,0,0,0,null,1,0,0,"","p","p",0]
["",0,0,0,0,null,null,null,null,null,"",{"$error":"#VALUE!"},"",{"$error":"#VALUE!"},"",{"$error":"#VALUE!"},"","","",{"$f":"IF(V601>0,COUNTIF(Q$7:Q601,\"=\"&Q601)-1,\"\")","v":""},"",0,0,0,0,0,0,0,0,0,0,0,0,0,0,0,0,0,0,0,0,0,0,0,0,0,0,0,0,0,0,0,0,0,0,0,0,0,0,0,0,0,0,0,0,0,0,0,0,0,0,0,0,0,0,0,0,0,0,0,0,0,0,0,0,0,0,0,0,0,0,0,0,0,0,0,0,0,0,0,null,1,0,0,"","p","p",0]
["",0,0,0,0,null,null,null,null,null,"",{"$error":"#VALUE!"},"",{"$error":"#VALUE!"},"",{"$error":"#VALUE!"},"","","",{"$f":"IF(V602>0,COUNTIF(Q$7:Q602,\"=\"&Q602)-1,\"\")","v":""},"",0,0,0,0,0,0,0,0,0,0,0,0,0,0,0,0,0,0,0,0,0,0,0,0,0,0,0,0,0,0,0,0,0,0,0,0,0,0,0,0,0,0,0,0,0,0,0,0,0,0,0,0,0,0,0,0,0,0,0,0,0,0,0,0,0,0,0,0,0,0,0,0,0,0,0,0,0,0,0,null,1,0,0,"","p","p",0]
["",0,0,0,0,null,null,null,null,null,"",{"$error":"#VALUE!"},"",{"$error":"#VALUE!"},"",{"$error":"#VALUE!"},"","","",{"$f":"IF(V603>0,COUNTIF(Q$7:Q603,\"=\"&Q603)-1,\"\")","v":""},"",0,0,0,0,0,0,0,0,0,0,0,0,0,0,0,0,0,0,0,0,0,0,0,0,0,0,0,0,0,0,0,0,0,0,0,0,0,0,0,0,0,0,0,0,0,0,0,0,0,0,0,0,0,0,0,0,0,0,0,0,0,0,0,0,0,0,0,0,0,0,0,0,0,0,0,0,0,0,0,null,1,0,0,"","p","p",0]
["",0,0,0,0,null,null,null,null,null,"",{"$error":"#VALUE!"},"",{"$error":"#VALUE!"},"",{"$error":"#VALUE!"},"","","",{"$f":"IF(V604>0,COUNTIF(Q$7:Q604,\"=\"&Q604)-1,\"\")","v":""},"",0,0,0,0,0,0,0,0,0,0,0,0,0,0,0,0,0,0,0,0,0,0,0,0,0,0,0,0,0,0,0,0,0,0,0,0,0,0,0,0,0,0,0,0,0,0,0,0,0,0,0,0,0,0,0,0,0,0,0,0,0,0,0,0,0,0,0,0,0,0,0,0,0,0,0,0,0,0,0,null,1,0,0,"","p","p",0]
["",0,0,0,0,null,null,null,null,null,"",{"$error":"#VALUE!"},"",{"$error":"#VALUE!"},"",{"$error":"#VALUE!"},"","","",{"$f":"IF(V605>0,COUNTIF(Q$7:Q605,\"=\"&Q605)-1,\"\")","v":""},"",0,0,0,0,0,0,0,0,0,0,0,0,0,0,0,0,0,0,0,0,0,0,0,0,0,0,0,0,0,0,0,0,0,0,0,0,0,0,0,0,0,0,0,0,0,0,0,0,0,0,0,0,0,0,0,0,0,0,0,0,0,0,0,0,0,0,0,0,0,0,0,0,0,0,0,0,0,0,0,null,1,0,0,"","p","p",0]
["",0,0,0,0,null,null,null,null,null,"",{"$error":"#VALUE!"},"",{"$error":"#VALUE!"},"",{"$error":"#VALUE!"},"","","",{"$f":"IF(V606>0,COUNTIF(Q$7:Q606,\"=\"&Q606)-1,\"\")","v":""},"",0,0,0,0,0,0,0,0,0,0,0,0,0,0,0,0,0,0,0,0,0,0,0,0,0,0,0,0,0,0,0,0,0,0,0,0,0,0,0,0,0,0,0,0,0,0,0,0,0,0,0,0,0,0,0,0,0,0,0,0,0,0,0,0,0,0,0,0,0,0,0,0,0,0,0,0,0,0,0,null,1,0,0,"","p","p",0]
["",0,0,0,0,null,null,null,null,null,"",{"$error":"#VALUE!"},"",{"$error":"#VALUE!"},"",{"$error":"#VALUE!"},"","","",{"$f":"IF(V607>0,COUNTIF(Q$7:Q607,\"=\"&Q607)-1,\"\")","v":""},"",0,0,0,0,0,0,{"$f":"IF($CZ607>0,$V607-LEN(SUBSTITUTE($J607,AB$4,\"\")),0)","v":0},0,0,0,0,0,0,0,0,0,{"$f":"IF($CZ607>0,$V607-LEN(SUBSTITUTE($J607,AL$4,\"\")),0)","v":0},0,0,0,0,0,0,0,0,0,{"$f":"IF($CZ607>0,$V607-LEN(SUBSTITUTE($J607,AV$4,\"\")),0)","v":0},0,0,0,0,0,0,0,0,0,0,0,0,{"$f":"IF($CZ607>0,$V607-LEN(SUBSTITUTE($J607,BI$4,\"\")),0)","v":0},0,0,0,0,0,0,0,0,0,{"$f":"IF($CZ607>0,$V607-LEN(SUBSTITUTE($J607,BS$4,\"\")),0)","v":0},0,0,0,0,0,0,0,0,0,{"$f":"IF($CZ607>0,$V607-LEN(SUBSTITUTE($J607,CC$4,\"\")),0)","v":0},0,0,0,0,0,0,0,0,0,0,{"$f":"IF($CZ607>0,$V607-LEN(SUBSTITUTE($J607,CN$4,\"\")),0)","v":0},0,0,0,0,0,0,0,0,null,1,0,0,"","p","p",0]
["",0,0,0,0,null,null,null,null,null,"",{"$error":"#VALUE!"},"",{"$error":"#VALUE!"},"",{"$error":"#VALUE!"},"","","",{"$f":"IF(V608>0,COUNTIF(Q$7:Q608,\"=\"&Q608)-1,\"\")","v":""},"",0,0,0,0,0,0,0,0,0,0,0,0,0,0,0,0,0,0,0,0,0,0,0,0,0,0,0,0,0,0,0,0,0,0,0,0,0,0,0,0,0,0,0,0,0,0,0,0,0,0,0,0,0,0,0,0,0,0,0,0,0,0,0,0,0,0,0,0,0,0,0,0,0,0,0,0,0,0,0,null,1,0,0,"","p","p",0]
["",0,0,0,0,null,null,null,null,null,"",{"$error":"#VALUE!"},"",{"$error":"#VALUE!"},"",{"$error":"#VALUE!"},"","","",{"$f":"IF(V609>0,COUNTIF(Q$7:Q609,\"=\"&Q609)-1,\"\")","v":""},"",0,0,0,0,0,0,0,0,0,0,0,0,0,0,0,0,0,0,0,0,0,0,0,0,0,0,0,0,0,0,0,0,0,0,0,0,0,0,0,0,0,0,0,0,0,0,0,0,0,0,0,0,0,0,0,0,0,0,0,0,0,0,0,0,0,0,0,0,0,0,0,0,0,0,0,0,0,0,0,null,1,0,0,"","p","p",0]
["",0,0,0,0,null,null,null,null,null,"",{"$error":"#VALUE!"},"",{"$error":"#VALUE!"},"",{"$error":"#VALUE!"},"","","",{"$f":"IF(V610>0,COUNTIF(Q$7:Q610,\"=\"&Q610)-1,\"\")","v":""},"",0,0,0,0,0,0,0,0,0,0,0,0,0,0,0,0,0,0,0,0,0,0,0,0,0,0,0,0,0,0,0,0,0,0,0,0,0,0,0,0,0,0,0,0,0,0,0,0,0,0,0,0,0,0,0,0,0,0,0,0,0,0,0,0,0,0,0,0,0,0,0,0,0,0,0,0,0,0,0,null,1,0,0,"","p","p",0]
["",0,0,0,0,null,null,null,null,null,"",{"$error":"#VALUE!"},"",{"$error":"#VALUE!"},"",{"$error":"#VALUE!"},"","","",{"$f":"IF(V611>0,COUNTIF(Q$7:Q611,\"=\"&Q611)-1,\"\")","v":""},"",0,0,0,0,0,0,0,0,0,0,0,0,0,0,0,0,0,0,0,0,0,0,0,0,0,0,0,0,0,0,0,0,0,0,0,0,0,0,0,0,0,0,0,0,0,0,0,0,0,0,0,0,0,0,0,0,0,0,0,0,0,0,0,0,0,0,0,0,0,0,0,0,0,0,0,0,0,0,0,null,1,0,0,"","p","p",0]
["",0,0,0,0,null,null,null,null,null,"",{"$error":"#VALUE!"},"",{"$error":"#VALUE!"},"",{"$error":"#VALUE!"},"","","",{"$f":"IF(V612>0,COUNTIF(Q$7:Q612,\"=\"&Q612)-1,\"\")","v":""},"",0,0,0,0,0,0,0,0,0,0,0,0,0,0,0,0,0,0,0,0,0,0,0,0,0,0,0,0,0,0,0,0,0,0,0,0,0,0,0,0,0,0,0,0,0,0,0,0,0,0,0,0,0,0,0,0,0,0,0,0,0,0,0,0,0,0,0,0,0,0,0,0,0,0,0,0,0,0,0,null,1,0,0,"","p","p",0]
["",0,0,0,0,null,null,null,null,null,"",{"$error":"#VALUE!"},"",{"$error":"#VALUE!"},"",{"$error":"#VALUE!"},"","","",{"$f":"IF(V613>0,COUNTIF(Q$7:Q613,\"=\"&Q613)-1,\"\")","v":""},"",0,0,0,0,0,0,0,0,0,0,0,0,0,0,0,0,0,0,0,0,0,0,0,0,0,0,0,0,0,0,0,0,0,0,0,0,0,0,0,0,0,0,0,0,0,0,0,0,0,0,0,0,0,0,0,0,0,0,0,0,0,0,0,0,0,0,0,0,0,0,0,0,0,0,0,0,0,0,0,null,1,0,0,"","p","p",0]
["",0,0,0,0,null,null,null,null,null,"",{"$error":"#VALUE!"},"",{"$error":"#VALUE!"},"",{"$error":"#VALUE!"},"","","",{"$f":"IF(V614>0,COUNTIF(Q$7:Q614,\"=\"&Q614)-1,\"\")","v":""},"",0,0,0,0,0,0,0,0,0,0,0,0,0,0,0,0,0,0,0,0,0,0,0,0,0,0,0,0,0,0,0,0,0,0,0,0,0,0,0,0,0,0,0,0,0,0,0,0,0,0,0,0,0,0,0,0,0,0,0,0,0,0,0,0,0,0,0,0,0,0,0,0,0,0,0,0,0,0,0,null,1,0,0,"","p","p",0]
["",0,0,0,0,null,null,null,null,null,"",{"$error":"#VALUE!"},"",{"$error":"#VALUE!"},"",{"$error":"#VALUE!"},"","","",{"$f":"IF(V615>0,COUNTIF(Q$7:Q615,\"=\"&Q615)-1,\"\")","v":""},"",0,0,0,0,0,0,0,0,0,0,0,0,0,0,0,0,0,0,0,0,0,0,0,0,0,0,0,0,0,0,0,0,0,0,0,0,0,0,0,0,0,0,0,0,0,0,0,0,0,0,0,0,0,0,0,0,0,0,0,0,0,0,0,0,0,0,0,0,0,0,0,0,0,0,{"$f":"IF($CZ615>0,$V615-LEN(SUBSTITUTE($J615,CR$4,\"\")),0)","v":0},0,0,0,0,null,1,0,0,"","p","p",0]
[{"$f":"IF(V616=0,\"\",A615+1)","v":""},0,0,0,0,null,null,null,null,null,{"$f":"IF(V616=0,\"\",SUMPRODUCT(W$5:CY$5,W616:CY616))","v":""},{"$f":"IF(C616=-1,\"\",K616-18.01528)","v":{"$error":"#VALUE!"}},{"$f":"IF(V616=0,\"\",SUMPRODUCT(W$6:CY$6,W616:CY616))","v":""},{"$f":"IF(C616=-1,\"\",M616-18.0105646861)","v":{"$error":"#VALUE!"}},{"$f":"IF(V616=0,\"\",M616+TRUNC(K616-M616-0.1))","v":""},{"$f":"IF(C616=-1,\"\",O616-18.0105646861)","v":{"$error":"#VALUE!"}},{"$f":"IF(V616>0,ROUND(K616,4),\"\")","v":""},{"$f":"IF(V616>0,S616+T616,\"\")","v":""},"",{"$f":"IF(V616>0,COUNTIF(Q$7:Q616,\"=\"&Q616)-1,\"\")","v":""},{"$f":"IF(V616>0,$R$6-R616+1,\"\")","v":""},{"$f":"LEN(J616)","v":0},0,0,0,0,0,0,0,0,0,0,0,0,0,0,0,0,0,0,0,0,0,0,0,0,0,0,0,0,0,0,0,0,0,0,0,0,0,{"$f":"IF($CZ616>0,$V616-LEN(SUBSTITUTE($J616,BH$4,\"\")),0)+DD616","v":0},0,0,0,0,0,0,0,0,0,0,0,0,0,0,0,0,0,0,0,0,0,0,0,0,0,0,0,0,0,0,0,0,0,0,0,0,0,0,0,{"$f":"V616+B616+C616","v":0},null,{"$f":"-(V616-1)+D616","v":1},{"$f":"E616","v":0},0,{"$f":"IF($B616=0,\"\",IF(F616=1,LEFT($B$2,LEN($B$2)-1),LEFT($B$3,LEN($B$3)-1)))","v":""},"p",{"$f":"DA616&J616&DB616","v":"p"},0]
["",0,0,0,0,null,null,null,null,null,"",{"$error":"#VALUE!"},"",{"$error":"#VALUE!"},"",{"$error":"#VALUE!"},"","","",{"$f":"IF(V617>0,COUNTIF(Q$7:Q617,\"=\"&Q617)-1,\"\")","v":""},"",0,0,0,0,0,0,0,0,0,0,0,0,0,0,0,0,0,0,0,0,0,0,0,0,0,0,0,0,0,0,0,0,0,0,0,0,0,0,0,0,0,0,0,0,0,0,0,0,0,0,0,0,0,0,0,0,0,0,0,0,0,0,0,0,0,0,0,0,0,0,0,0,0,0,0,0,0,0,0,null,1,0,0,"","p","p",0]
["",0,0,0,0,null,null,null,null,null,"",{"$error":"#VALUE!"},"",{"$error":"#VALUE!"},"",{"$error":"#VALUE!"},"","","",{"$f":"IF(V618>0,COUNTIF(Q$7:Q618,\"=\"&Q618)-1,\"\")","v":""},"",0,0,0,0,0,0,{"$f":"IF($CZ618>0,$V618-LEN(SUBSTITUTE($J618,AB$4,\"\")),0)","v":0},0,0,0,0,0,0,0,0,0,0,0,0,0,0,{"$f":"IF($CZ618>0,$V618-LEN(SUBSTITUTE($J618,AQ$4,\"\")),0)","v":0},0,0,0,0,{"$f":"IF($CZ618>0,$V618-LEN(SUBSTITUTE($J618,AV$4,\"\")),0)","v":0},0,0,0,0,0,0,0,0,0,0,0,0,{"$f":"IF($CZ618>0,$V618-LEN(SUBSTITUTE($J618,BI$4,\"\")),0)","v":0},0,0,0,0,0,0,0,0,0,0,0,0,0,0,{"$f":"IF($CZ618>0,$V618-LEN(SUBSTITUTE($J618,BX$4,\"\")),0)","v":0},0,0,0,0,{"$f":"IF($CZ618>0,$V618-LEN(SUBSTITUTE($J618,CC$4,\"\")),0)","v":0},0,0,0,0,0,0,0,0,0,0,0,0,0,0,0,0,0,0,0,null,1,0,0,"","p","p",0]
["",0,0,0,0,null,null,null,null,null,"",{"$error":"#VALUE!"},"",{"$error":"#VALUE!"},"",{"$error":"#VALUE!"},"","","",{"$f":"IF(V619>0,COUNTIF(Q$7:Q619,\"=\"&Q619)-1,\"\")","v":""},"",0,0,0,0,0,0,{"$f":"IF($CZ619>0,$V619-LEN(SUBSTITUTE($J619,AB$4,\"\")),0)","v":0},0,0,0,0,0,0,0,0,0,0,0,0,0,0,0,0,0,0,0,{"$f":"IF($CZ619>0,$V619-LEN(SUBSTITUTE($J619,AV$4,\"\")),0)","v":0},0,0,0,0,0,0,0,0,0,0,0,0,{"$f":"IF($CZ619>0,$V619-LEN(SUBSTITUTE($J619,BI$4,\"\")),0)","v":0},0,0,0,0,0,0,0,0,0,0,0,0,0,0,0,0,0,0,0,0,0,0,0,0,0,0,0,0,0,0,0,0,0,0,0,0,0,0,0,null,1,0,0,"","p","p",0]
["",0,0,0,0,null,null,null,null,null,"",{"$error":"#VALUE!"},"",{"$error":"#VALUE!"},"",{"$error":"#VALUE!"},"","","",{"$f":"IF(V620>0,COUNTIF(Q$7:Q620,\"=\"&Q620)-1,\"\")","v":""},"",0,0,0,0,0,0,0,0,0,0,0,0,0,0,0,0,0,0,0,0,0,0,0,0,0,0,0,0,0,0,0,0,0,0,0,0,0,0,0,0,0,0,0,0,0,0,0,0,0,0,0,0,0,0,0,0,0,0,0,0,0,0,0,0,0,0,0,0,0,0,0,0,0,0,0,0,0,0,0,null,1,0,0,"","p","p",0]
["",0,0,0,0,null,null,null,null,null,"",{"$error":"#VALUE!"},"",{"$error":"#VALUE!"},"",{"$error":"#VALUE!"},"","","",{"$f":"IF(V621>0,COUNTIF(Q$7:Q621,\"=\"&Q621)-1,\"\")","v":""},"",0,0,0,0,0,0,0,0,0,0,0,0,0,0,0,0,0,0,0,0,0,0,0,0,0,0,0,0,0,0,0,0,0,0,0,0,0,0,0,0,0,0,0,0,0,0,0,0,0,0,0,0,0,0,0,0,0,0,0,0,0,0,0,0,0,0,0,0,0,0,0,0,0,0,0,0,0,0,0,null,1,0,0,"","p","p",0]
["",0,0,0,0,null,null,null,null,null,"",{"$error":"#VALUE!"},"",{"$error":"#VALUE!"},"",{"$error":"#VALUE!"},"","","",{"$f":"IF(V622>0,COUNTIF(Q$7:Q622,\"=\"&Q622)-1,\"\")","v":""},"",0,0,0,0,0,0,0,0,0,0,0,0,0,0,0,0,0,0,0,0,0,0,0,0,0,0,0,0,0,0,0,0,0,0,0,0,0,0,0,0,0,0,0,0,0,0,0,0,0,0,0,0,0,0,0,0,0,0,0,0,0,0,0,0,0,0,0,0,0,0,0,0,0,0,0,0,0,0,0,null,1,0,0,"","p","p",0]
["",0,0,0,0,null,null,null,null,null,"",{"$error":"#VALUE!"},"",{"$error":"#VALUE!"},"",{"$error":"#VALUE!"},"","","",{"$f":"IF(V623>0,COUNTIF(Q$7:Q623,\"=\"&Q623)-1,\"\")","v":""},"",0,0,0,0,0,0,0,0,0,0,0,0,0,0,0,0,0,0,0,0,0,0,0,0,0,0,0,0,0,0,0,0,0,0,0,0,0,0,0,0,0,0,0,0,0,0,0,0,0,0,0,0,0,0,0,0,0,0,0,0,0,0,0,0,0,0,0,0,0,0,0,0,0,0,0,0,0,0,0,null,1,0,0,"","p","p",0]
["",0,0,0,0,null,null,null,null,null,"",{"$error":"#VALUE!"},"",{"$error":"#VALUE!"},"",{"$error":"#VALUE!"},"","","",{"$f":"IF(V624>0,COUNTIF(Q$7:Q624,\"=\"&Q624)-1,\"\")","v":""},"",0,{"$f":"$V624-LEN(SUBSTITUTE($J624,W$4,\"\"))","v":0},0,0,0,0,0,0,0,0,0,0,0,0,0,0,0,0,0,0,0,0,0,0,0,0,0,0,0,0,0,0,0,0,0,0,0,0,0,0,0,0,0,0,0,0,0,0,0,0,0,0,0,0,0,0,0,0,0,{"$f":"IF($CZ624>0,$V624-LEN(SUBSTITUTE($J624,CC$4,\"\")),0)","v":0},0,0,0,0,0,0,0,0,0,{"$f":"IF($CZ624>0,$V624-LEN(SUBSTITUTE($J624,CM$4,\"\")),0)","v":0},0,0,0,0,0,0,0,0,0,null,1,0,0,"","p","p",0]
["",0,0,0,0,null,null,null,null,null,"",{"$error":"#VALUE!"},"",{"$error":"#VALUE!"},"",{"$error":"#VALUE!"},"","","",{"$f":"IF(V625>0,COUNTIF(Q$7:Q625,\"=\"&Q625)-1,\"\")","v":""},"",0,0,0,0,0,0,0,0,0,0,0,0,0,0,0,0,0,0,0,0,0,0,0,0,0,0,0,0,0,0,0,0,0,0,0,0,0,0,0,0,0,0,0,0,0,0,0,0,0,0,0,0,0,0,{"$f":"IF($CZ625>0,$V625-LEN(SUBSTITUTE($J625,BX$4,\"\")),0)","v":0},0,0,0,0,0,0,0,0,0,0,0,0,0,0,0,0,0,0,0,0,0,0,0,0,null,1,0,0,"","p","p",0]
["",0,0,0,0,null,null,null,null,null,"",{"$error":"#VALUE!"},"",{"$error":"#VALUE!"},"",{"$error":"#VALUE!"},"","","",{"$f":"IF(V626>0,COUNTIF(Q$7:Q626,\"=\"&Q626)-1,\"\")","v":""},"",0,0,0,0,0,0,{"$f":"IF($CZ626>0,$V626-LEN(SUBSTITUTE($J626,AB$4,\"\")),0)","v":0},0,0,0,0,0,0,0,0,0,{"$f":"IF($CZ626>0,$V626-LEN(SUBSTITUTE($J626,AL$4,\"\")),0)","v":0},0,0,0,0,0,{"$f":"IF($CZ626>0,$V626-LEN(SUBSTITUTE($J626,AR$4,\"\")),0)","v":0},0,0,0,0,0,0,0,0,0,0,0,0,0,0,0,0,0,0,0,0,0,0,0,0,0,0,0,0,0,0,0,{"$f":"IF($CZ626>0,$V626-LEN(SUBSTITUTE($J626,BX$4,\"\")),0)","v":0},0,0,0,0,0,0,0,0,0,0,0,0,0,0,0,0,0,0,0,0,0,0,0,0,null,1,0,0,"","p","p",0]
["",0,0,0,0,null,null,null,null,null,"",{"$error":"#VALUE!"},"",{"$error":"#VALUE!"},"",{"$error":"#VALUE!"},"","","",{"$f":"IF(V627>0,COUNTIF(Q$7:Q627,\"=\"&Q627)-1,\"\")","v":""},"",0,0,0,0,0,0,0,0,0,0,0,0,0,0,0,0,0,0,0,0,0,0,0,0,0,0,0,0,0,0,0,0,0,0,0,0,0,0,0,0,0,0,0,0,0,0,0,0,0,0,0,0,0,0,{"$f":"IF($CZ627>0,$V627-LEN(SUBSTITUTE($J627,BX$4,\"\")),0)","v":0},0,0,0,0,0,0,0,0,0,0,0,0,0,0,0,0,0,0,0,0,0,0,0,0,null,1,0,0,"","p","p",0]
["",0,0,0,0,null,null,null,null,null,"",{"$error":"#VALUE!"},"",{"$error":"#VALUE!"},"",{"$error":"#VALUE!"},"","","",{"$f":"IF(V628>0,COUNTIF(Q$7:Q628,\"=\"&Q628)-1,\"\")","v":""},"",0,0,0,0,0,0,0,0,0,0,0,0,0,0,0,0,0,0,0,0,0,0,0,0,0,0,0,0,0,0,0,0,0,0,0,0,0,0,0,0,0,0,0,0,0,0,0,0,0,0,0,0,0,0,0,0,0,0,0,0,0,0,0,0,0,0,0,0,0,0,0,0,0,0,0,0,0,0,0,null,1,0,0,"","p","p",0]
["",0,0,0,0,null,null,null,null,null,"",{"$error":"#VALUE!"},"",{"$error":"#VALUE!"},"",{"$error":"#VALUE!"},"","","",{"$f":"IF(V629>0,COUNTIF(Q$7:Q629,\"=\"&Q629)-1,\"\")","v":""},"",0,0,0,0,0,0,{"$f":"IF($CZ629>0,$V629-LEN(SUBSTITUTE($J629,AB$4,\"\")),0)","v":0},0,0,0,0,0,0,0,0,0,0,0,0,0,0,0,0,0,0,0,{"$f":"IF($CZ629>0,$V629-LEN(SUBSTITUTE($J629,AV$4,\"\")),0)","v":0},0,0,0,0,0,0,0,0,0,0,0,0,0,0,0,0,0,0,0,0,0,0,0,0,0,0,0,0,0,0,0,0,0,0,0,0,0,0,0,0,0,0,0,0,0,0,0,0,0,0,0,0,null,1,0,0,"","p","p",0]
["",0,0,0,0,null,null,null,null,null,"",{"$error":"#VALUE!"},"",{"$error":"#VALUE!"},"",{"$error":"#VALUE!"},"","","",{"$f":"IF(V630>0,COUNTIF(Q$7:Q630,\"=\"&Q630)-1,\"\")","v":""},"",0,0,0,0,0,0,0,0,0,0,0,0,0,0,0,0,0,0,0,0,0,0,0,0,0,0,0,0,0,0,0,0,0,0,0,0,0,0,0,0,0,0,0,0,0,0,0,0,0,0,0,0,0,0,0,0,0,0,0,0,0,0,0,0,0,0,0,0,0,0,0,0,0,0,0,0,0,0,0,null,1,0,0,"","p","p",0]
["",0,0,0,0,null,null,null,null,null,"",{"$error":"#VALUE!"},"",{"$error":"#VALUE!"},"",{"$error":"#VALUE!"},"","","",{"$f":"IF(V631>0,COUNTIF(Q$7:Q631,\"=\"&Q631)-1,\"\")","v":""},"",0,0,0,0,0,0,0,0,0,0,0,0,0,0,0,0,0,0,0,0,0,0,0,0,0,0,0,0,0,0,0,0,0,0,0,0,0,0,0,0,0,0,0,0,0,0,0,0,0,0,0,0,0,0,0,0,0,0,0,0,0,0,0,0,0,0,0,0,0,0,{"$f":"IF($CZ631>0,$V631-LEN(SUBSTITUTE($J631,CN$4,\"\")),0)","v":0},0,0,0,0,0,0,0,0,null,1,0,0,"","p","p",0]
["",0,0,0,0,null,null,null,null,null,"",{"$error":"#VALUE!"},"",{"$error":"#VALUE!"},"",{"$error":"#VALUE!"},"","","",{"$f":"IF(V632>0,COUNTIF(Q$7:Q632,\"=\"&Q632)-1,\"\")","v":""},"",0,0,0,0,0,0,0,0,0,0,0,0,0,0,0,0,0,0,0,0,0,0,0,0,0,0,0,0,0,0,0,0,0,0,0,0,0,0,0,0,0,0,0,0,0,0,0,0,0,0,0,0,0,0,0,0,0,0,0,0,0,0,0,0,0,0,0,0,0,0,0,0,0,0,0,0,0,0,0,null,1,0,0,"","p","p",0]
["",0,0,0,0,null,null,null,null,null,"",{"$error":"#VALUE!"},"",{"$error":"#VALUE!"},"",{"$error":"#VALUE!"},"","","",{"$f":"IF(V633>0,COUNTIF(Q$7:Q633,\"=\"&Q633)-1,\"\")","v":""},"",0,0,0,0,0,0,0,0,0,0,0,0,0,0,0,0,0,0,0,0,0,0,0,0,0,0,0,0,0,0,0,0,0,0,0,0,0,0,0,0,0,0,0,0,0,0,0,0,0,0,0,0,0,0,0,0,0,0,0,0,0,0,0,0,0,0,0,0,0,0,0,0,0,0,0,0,0,0,0,null,1,0,0,"","p","p",0]
["",0,0,0,0,null,null,null,null,null,"",{"$error":"#VALUE!"},"",{"$error":"#VALUE!"},"",{"$error":"#VALUE!"},"","","",{"$f":"IF(V634>0,COUNTIF(Q$7:Q634,\"=\"&Q634)-1,\"\")","v":""},"",0,0,0,0,0,0,0,0,0,0,0,0,0,0,0,0,0,0,0,0,0,0,0,0,0,0,0,0,0,0,0,0,0,0,0,0,0,0,0,0,0,0,0,0,0,0,0,0,0,0,0,0,0,0,0,0,0,0,0,0,0,0,0,0,0,0,0,0,0,0,0,0,0,0,0,0,0,0,0,null,1,0,0,"","p","p",0]
["",0,0,0,0,null,null,null,null,null,"",{"$error":"#VALUE!"},"",{"$error":"#VALUE!"},"",{"$error":"#VALUE!"},"","","",{"$f":"IF(V635>0,COUNTIF(Q$7:Q635,\"=\"&Q635)-1,\"\")","v":""},"",0,0,0,0,0,0,0,0,0,0,0,0,0,0,0,0,0,0,0,0,0,0,{"$f":"IF($CZ635>0,$V635-LEN(SUBSTITUTE($J635,AR$4,\"\")),0)","v":0},{"$f":"IF($CZ635>0,$V635-LEN(SUBSTITUTE($J635,AS$4,\"\")),0)","v":0},0,0,0,0,0,0,0,0,0,0,0,0,0,0,0,0,0,0,0,0,0,0,0,0,0,0,0,0,0,0,0,0,0,0,0,0,0,0,0,0,0,0,0,0,0,0,0,0,0,0,0,0,0,0,0,null,1,0,0,"","p","p",0]
["",0,0,0,0,null,null,null,null,null,"",{"$error":"#VALUE!"},"",{"$error":"#VALUE!"},"",{"$error":"#VALUE!"},"","","",{"$f":"IF(V636>0,COUNTIF(Q$7:Q636,\"=\"&Q636)-1,\"\")","v":""},"",0,0,0,0,0,0,0,0,0,0,0,0,0,0,0,0,0,0,0,0,0,0,0,0,0,0,0,0,0,0,0,0,0,0,0,0,0,0,0,0,0,0,0,0,0,0,0,0,0,0,0,0,0,0,0,0,0,0,0,0,0,0,0,0,0,0,0,0,0,0,0,0,0,0,0,0,0,0,0,null,1,0,0,"","p","p",0]
["",0,0,0,0,null,null,null,null,null,"",{"$error":"#VALUE!"},"",{"$error":"#VALUE!"},"",{"$error":"#VALUE!"},"","","",{"$f":"IF(V637>0,COUNTIF(Q$7:Q637,\"=\"&Q637)-1,\"\")","v":""},"",0,0,0,0,0,0,0,0,0,0,0,0,0,0,0,0,0,0,0,0,0,0,0,0,0,0,0,0,0,0,0,0,0,0,0,0,0,0,0,0,0,0,0,0,0,0,0,0,0,0,0,0,0,0,0,0,0,0,0,0,0,0,0,0,0,0,0,0,0,0,0,0,0,0,0,0,0,0,0,null,1,0,0,"","p","p",0]
["",0,0,0,0,null,null,null,null,null,"",{"$error":"#VALUE!"},"",{"$error":"#VALUE!"},"",{"$error":"#VALUE!"},"","","",{"$f":"IF(V638>0,COUNTIF(Q$7:Q638,\"=\"&Q638)-1,\"\")","v":""},"",0,0,0,0,0,0,{"$f":"IF($CZ638>0,$V638-LEN(SUBSTITUTE($J638,AB$4,\"\")),0)","v":0},0,0,0,0,0,0,0,0,0,{"$f":"IF($CZ638>0,$V638-LEN(SUBSTITUTE($J638,AL$4,\"\")),0)","v":0},0,0,0,0,0,0,0,0,0,0,0,0,0,0,0,0,0,0,0,0,0,0,0,0,0,0,0,0,0,0,0,0,0,0,0,0,0,0,0,0,0,0,0,0,0,0,0,0,0,0,0,0,0,0,0,0,0,0,0,0,0,0,null,1,0,0,"","p","p",0]
["",0,0,0,0,null,null,null,null,null,"",{"$error":"#VALUE!"},"",{"$error":"#VALUE!"},"",{"$error":"#VALUE!"},"","","",{"$f":"IF(V639>0,COUNTIF(Q$7:Q639,\"=\"&Q639)-1,\"\")","v":""},"",0,0,0,0,0,0,0,0,0,0,0,0,0,0,0,0,0,0,0,0,0,0,0,0,0,0,0,0,0,0,0,0,0,0,0,0,0,0,0,0,0,0,0,0,0,0,0,0,0,0,0,0,0,0,0,0,0,0,0,0,0,0,0,0,0,0,0,0,0,0,0,0,0,0,0,0,0,0,0,null,1,0,0,"","p","p",0]
["",0,0,0,0,null,null,null,null,null,"",{"$error":"#VALUE!"},"",{"$error":"#VALUE!"},"",{"$error":"#VALUE!"},"","","",{"$f":"IF(V640>0,COUNTIF(Q$7:Q640,\"=\"&Q640)-1,\"\")","v":""},"",0,0,0,0,0,0,0,0,0,0,0,0,0,0,0,0,0,0,0,0,0,0,0,0,0,0,0,0,0,0,0,0,0,0,0,0,0,0,0,0,0,0,0,0,0,0,0,0,0,0,0,0,0,0,0,0,0,0,0,0,0,0,0,0,0,0,0,0,0,0,0,0,0,0,0,0,0,0,0,null,1,0,0,"","p","p",0]
["",0,0,0,0,null,null,null,null,null,"",{"$error":"#VALUE!"},"",{"$error":"#VALUE!"},"",{"$error":"#VALUE!"},"","","",{"$f":"IF(V641>0,COUNTIF(Q$7:Q641,\"=\"&Q641)-1,\"\")","v":""},"",0,0,0,0,0,0,0,0,0,0,0,0,0,0,0,0,0,0,0,0,0,0,0,0,0,0,0,0,0,0,0,0,0,0,0,0,0,0,0,0,0,0,0,0,0,0,0,0,0,0,0,0,0,0,0,0,0,0,0,0,0,0,0,0,0,0,0,0,0,{"$f":"IF($CZ641>0,$V641-LEN(SUBSTITUTE($J641,CM$4,\"\")),0)","v":0},0,0,0,0,0,0,0,0,0,null,1,0,0,"","p","p",0]
["",0,0,0,0,null,null,null,null,null,"",{"$error":"#VALUE!"},"",{"$error":"#VALUE!"},"",{"$error":"#VALUE!"},"","","",{"$f":"IF(V642>0,COUNTIF(Q$7:Q642,\"=\"&Q642)-1,\"\")","v":""},"",0,0,0,0,0,0,0,0,0,0,0,0,0,0,0,0,0,0,0,0,0,0,0,0,0,0,0,0,0,0,0,0,0,0,0,0,0,0,0,0,0,0,0,0,0,0,0,0,0,0,0,0,0,0,0,0,0,0,0,0,0,0,0,0,0,0,0,0,0,0,0,0,0,0,0,0,0,0,0,null,1,0,0,"","p","p",0]
["",0,0,0,0,null,null,null,null,null,"",{"$error":"#VALUE!"},"",{"$error":"#VALUE!"},"",{"$error":"#VALUE!"},"","","",{"$f":"IF(V643>0,COUNTIF(Q$7:Q643,\"=\"&Q643)-1,\"\")","v":""},"",0,0,0,0,0,0,0,0,0,0,0,0,0,0,0,0,0,0,0,0,0,0,0,0,0,0,0,0,0,0,0,0,0,0,0,0,0,0,0,0,0,0,0,0,0,0,0,0,0,0,0,0,0,{"$f":"IF($CZ643>0,$V643-LEN(SUBSTITUTE($J643,BW$4,\"\")),0)","v":0},0,0,0,0,0,0,0,0,0,0,0,0,0,0,0,0,0,0,0,0,0,0,0,0,0,null,1,0,0,"","p","p",0]
["",0,0,0,0,null,null,null,null,null,"",{"$error":"#VALUE!"},"",{"$error":"#VALUE!"},"",{"$error":"#VALUE!"},"","","",{"$f":"IF(V644>0,COUNTIF(Q$7:Q644,\"=\"&Q644)-1,\"\")","v":""},"",0,0,0,0,0,0,0,0,0,0,0,0,0,0,0,0,0,0,0,0,0,0,0,0,0,0,0,0,0,0,0,0,0,0,0,0,0,0,0,0,0,0,0,0,0,0,0,0,0,0,0,0,0,0,0,0,0,0,0,0,0,0,0,0,0,0,0,0,0,0,0,0,0,0,0,0,0,0,0,null,1,0,0,"","p","p",0]
["",0,0,0,0,null,null,null,null,null,"",{"$error":"#VALUE!"},"",{"$error":"#VALUE!"},"",{"$error":"#VALUE!"},"","","",{"$f":"IF(V645>0,COUNTIF(Q$7:Q645,\"=\"&Q645)-1,\"\")","v":""},"",0,0,0,0,0,0,0,0,0,0,0,0,0,0,0,0,0,0,0,0,0,0,0,0,0,0,0,0,0,0,0,0,0,0,0,0,0,0,0,0,0,0,0,0,0,0,0,0,0,0,0,0,0,0,0,0,0,0,0,0,0,0,0,0,0,0,0,0,0,0,0,0,0,0,0,0,0,0,0,null,1,0,0,"","p","p",0]
["",0,0,0,0,null,null,null,null,null,"",{"$error":"#VALUE!"},"",{"$error":"#VALUE!"},"",{"$error":"#VALUE!"},"","","",{"$f":"IF(V646>0,COUNTIF(Q$7:Q646,\"=\"&Q646)-1,\"\")","v":""},"",0,0,0,0,0,0,0,0,0,0,0,0,0,0,0,0,0,0,0,0,0,0,0,0,0,0,0,0,0,0,0,0,0,0,0,0,0,0,0,0,0,0,0,0,0,0,0,0,0,0,0,0,0,0,0,0,0,0,0,0,0,0,0,0,0,0,0,0,0,0,0,0,0,0,0,0,0,0,0,null,1,0,0,"","p","p",0]
["",0,{"$f":"IF($C$2=\"forced-OH\",-1,IF($G647=1,$C$3,IF($G647=2,$D$3,0)))","v":0},{"$f":"IF($F647=1,VLOOKUP($B$2,$DE$5:$DI$11,5,FALSE),0)","v":0},{"$f":"IF($F647=1,VLOOKUP($B$2,$DE$5:$DG$11,3,FALSE),0)","v":0},null,null,null,null,null,"",{"$error":"#VALUE!"},"",{"$error":"#VALUE!"},"",{"$error":"#VALUE!"},"","","",{"$f":"IF(V647>0,COUNTIF(Q$7:Q647,\"=\"&Q647)-1,\"\")","v":""},"",0,0,0,0,0,0,{"$f":"IF($CZ647>0,$V647-LEN(SUBSTITUTE($J647,AB$4,\"\")),0)","v":0},0,0,0,0,0,0,0,0,0,{"$f":"IF($CZ647>0,$V647-LEN(SUBSTITUTE($J647,AL$4,\"\")),0)","v":0},0,0,0,0,0,0,0,0,0,0,0,0,0,0,0,0,0,0,0,0,0,0,0,0,0,0,0,0,0,0,0,0,0,0,0,0,0,0,0,0,0,0,0,0,0,0,0,0,0,0,0,0,0,{"$f":"IF($CZ647>0,$V647-LEN(SUBSTITUTE($J647,CN$4,\"\")),0)","v":0},0,0,0,0,0,0,0,0,null,1,0,{"$f":"$V647-$W647-$X647-$Z647-$AA647","v":0},"",{"$f":"IF($C647=0,\"p\",\"\")","v":"p"},"p",{"$f":"IF($F647=1,VLOOKUP($B$2,$DE$5:$DH$11,4,FALSE),0)","v":0}]
["",{"$f":"IF($F648=1,VLOOKUP($B$2,$DE$5:$DG$11,2,FALSE),IF($F648=2,VLOOKUP($B$3,$DE$5:$DG$6,2,FALSE),0))","v":0},{"$f":"IF($C$2=\"forced-OH\",-1,IF($G648=1,$C$3,IF($G648=2,$D$3,0)))","v":0},{"$f":"IF($F648=1,VLOOKUP($B$2,$DE$5:$DI$11,5,FALSE),0)","v":0},{"$f":"IF($F648=1,VLOOKUP($B$2,$DE$5:$DG$11,3,FALSE),0)","v":0},null,null,null,null,null,"",{"$error":"#VALUE!"},"",{"$error":"#VALUE!"},"",{"$error":"#VALUE!"},"","","",{"$f":"IF(V648>0,COUNTIF(Q$7:Q648,\"=\"&Q648)-1,\"\")","v":""},"",0,0,0,0,0,0,0,0,0,0,0,0,0,0,0,0,0,0,0,0,0,0,0,0,0,0,0,0,0,0,0,0,0,0,0,0,0,0,0,0,0,0,0,0,0,0,0,0,0,0,0,0,0,0,0,0,0,0,0,0,0,0,0,0,0,0,0,0,0,0,0,0,0,0,0,0,0,0,0,null,1,0,{"$f":"$V648-$W648-$X648-$Z648-$AA648","v":0},"",{"$f":"IF($C648=0,\"p\",\"\")","v":"p"},"p",{"$f":"IF($F648=1,VLOOKUP($B$2,$DE$5:$DH$11,4,FALSE),0)","v":0}]
["",{"$f":"IF($F649=1,VLOOKUP($B$2,$DE$5:$DG$11,2,FALSE),IF($F649=2,VLOOKUP($B$3,$DE$5:$DG$6,2,FALSE),0))","v":0},{"$f":"IF($C$2=\"forced-OH\",-1,IF($G649=1,$C$3,IF($G649=2,$D$3,0)))","v":0},{"$f":"IF($F649=1,VLOOKUP($B$2,$DE$5:$DI$11,5,FALSE),0)","v":0},{"$f":"IF($F649=1,VLOOKUP($B$2,$DE$5:$DG$11,3,FALSE),0)","v":0},null,null,null,null,null,"",{"$error":"#VALUE!"},"",{"$error":"#VALUE!"},"",{"$error":"#VALUE!"},"","","",{"$f":"IF(V649>0,COUNTIF(Q$7:Q649,\"=\"&Q649)-1,\"\")","v":""},"",0,0,0,0,0,0,0,0,0,0,0,0,0,0,0,0,0,0,0,0,0,0,0,0,0,0,0,0,0,0,0,0,0,0,0,0,0,0,0,0,0,0,0,0,0,0,0,0,0,0,0,0,0,0,0,0,0,0,0,0,0,0,0,0,0,0,0,0,0,0,0,0,0,0,0,0,0,0,0,null,1,0,{"$f":"$V649-$W649-$X649-$Z649-$AA649","v":0},"",{"$f":"IF($C649=0,\"p\",\"\")","v":"p"},"p",{"$f":"IF($F649=1,VLOOKUP($B$2,$DE$5:$DH$11,4,FALSE),0)","v":0}]
["",{"$f":"IF($F650=1,VLOOKUP($B$2,$DE$5:$DG$11,2,FALSE),IF($F650=2,VLOOKUP($B$3,$DE$5:$DG$6,2,FALSE),0))","v":0},{"$f":"IF($C$2=\"forced-OH\",-1,IF($G650=1,$C$3,IF($G650=2,$D$3,0)))","v":0},{"$f":"IF($F650=1,VLOOKUP($B$2,$DE$5:$DI$11,5,FALSE),0)","v":0},{"$f":"IF($F650=1,VLOOKUP($B$2,$DE$5:$DG$11,3,FALSE),0)","v":0},null,null,null,null,null,"",{"$error":"#VALUE!"},"",{"$error":"#VALUE!"},"",{"$error":"#VALUE!"},"","","",{"$f":"IF(V650>0,COUNTIF(Q$7:Q650,\"=\"&Q650)-1,\"\")","v":""},"",0,0,0,0,0,0,0,0,0,0,0,0,0,0,0,0,0,0,0,0,0,0,0,0,0,0,0,0,0,0,0,0,0,0,0,0,0,0,0,0,0,0,0,0,0,0,0,0,0,0,0,0,0,0,0,0,0,0,0,0,0,0,0,0,0,0,0,0,0,0,0,0,0,0,0,0,0,0,0,null,1,0,{"$f":"$V650-$W650-$X650-$Z650-$AA650","v":0},"",{"$f":"IF($C650=0,\"p\",\"\")","v":"p"},"p",{"$f":"IF($F650=1,VLOOKUP($B$2,$DE$5:$DH$11,4,FALSE),0)","v":0}]
["",{"$f":"IF($F651=1,VLOOKUP($B$2,$DE$5:$DG$11,2,FALSE),IF($F651=2,VLOOKUP($B$3,$DE$5:$DG$6,2,FALSE),0))","v":0},{"$f":"IF($C$2=\"forced-OH\",-1,IF($G651=1,$C$3,IF($G651=2,$D$3,0)))","v":0},{"$f":"IF($F651=1,VLOOKUP($B$2,$DE$5:$DI$11,5,FALSE),0)","v":0},{"$f":"IF($F651=1,VLOOKUP($B$2,$DE$5:$DG$11,3,FALSE),0)","v":0},null,null,null,null,null,"",{"$error":"#VALUE!"},"",{"$error":"#VALUE!"},"",{"$error":"#VALUE!"},"","","",{"$f":"IF(V651>0,COUNTIF(Q$7:Q651,\"=\"&Q651)-1,\"\")","v":""},"",0,0,0,0,0,0,0,0,0,0,0,0,0,0,0,{"$f":"IF($CZ651>0,$V651-LEN(SUBSTITUTE($J651,AK$4,\"\")),0)","v":0},0,0,0,0,0,0,0,0,0,0,0,0,0,0,0,0,0,0,0,0,0,0,0,0,0,0,0,0,0,0,0,0,0,0,0,0,0,0,0,0,0,0,0,0,0,0,0,0,0,0,0,0,0,0,0,0,0,0,0,0,0,0,0,null,1,0,{"$f":"$V651-$W651-$X651-$Z651-$AA651","v":0},"",{"$f":"IF($C651=0,\"p\",\"\")","v":"p"},"p",{"$f":"IF($F651=1,VLOOKUP($B$2,$DE$5:$DH$11,4,FALSE),0)","v":0}]

{"sheet":"Nucleoside table","index":2,"n_rows":79,"n_cols":9,"rows_kept":79,"cut":false,"hidden":false,"merged":[]}
[null,null,"common name","1-letter name"]
[null,null,"慣用表記","1文字","average","mono isotopic","別名"]
[null,null,"C","C",243.21662000000003,243.08552054839998,null,"N","ユーザー定義"]
[null,null,"U","U",244.20138,244.06953613140001]
[null,null,"T","T",258.22796,258.08518619519998]
[null,null,"A","A",267.24131999999997,267.09675394089999]
[null,null,"G","G",283.24072000000001,283.09166856320002]
[null,null,"Ar(p)","^",479.33584200000007,479.10534307410001,null,"特殊文字"]
[null,null,"Am",":",281.2679,281.11240400470001,null,"~, ?, *を検索するときは~でエスケープしたクエリを投げる必要がある。"]
[null,null,"Gm","#",297.26730000000003,297.10731862699998]
[null,null,"f5Cm","°",285.25330000000002,285.09608523449998,null,"１文字表記の拡張"]
[null,null,"ncm5Um","~",315.27927999999997,315.10664992059998,null,"独自拡張した部分は、適当に決めたものであって、外では通用しないので注意。"]
[null,null,"cmnm5Um",")",345.30525999999998,345.11721460669997,null,"（そもそも１文字表記自体、RNAのデータベース関係の人以外には通用しません。）"]
[null,null,"m5Um","\\",272.25454000000002,272.100836259,null,"ユニコード　ラテン補助の記号つきAから順番に割り当てている。"]
[null,null,"Um","J",258.22796,258.08518619519998,null,"@とHは未同定修飾に割り当てられていたものなので、扱いに注意を要する。"]
[null,null,"Cm","B",257.2432,257.10117061220001]
[null,null,"m6A","=",281.2679,281.11240400470001]
[null,null,"m2A","/",281.2679,281.11240400470001]
[null,null,"m1A","\"",281.2679,281.11240400470001,null,"これは単なる表です。"]
[null,null,"i6A","+",335.35834,335.15935419610003,null,"ここに追加しても計算には使われません。"]
[null,null,"ms2i6A","*",381.44991999999996,381.14707498989998,null,"This is just a table."]
[null,null,"io6A","`",351.35774000000004,351.1542688184,null,"Even if you add a new modification here, they can't be used for calculation!"]
[null,null,"m3C","'",257.2432,257.10117061220001]
[null,null,"mchm5U",",",332.26343999999995,332.08558012589998]
[null,null,"m2,2Gm","|",325.32045999999997,325.13861875459997]
[null,null,"mnm5U","{",287.26918000000001,287.1117352983]
[null,null,"ms2t6A","[",458.44628,458.12198245460002]
[null,null,"m1Y","]",258.22796,258.08518619519998,"m1ψ"]
[null,null,"f5C",">",271.22672,271.08043517070001]
[null,null,"m5C","?",257.2432,257.10117061220001]
[null,null,"s2C","%",259.28222000000005,259.0626766561]
[null,null,"cmnm5s2U","$",347.34427999999997,347.07872065059996]
[null,null,"cmnm5U","!",331.27868000000001,331.10156454290001]
[null,null,"mcm5U","1",316.26403999999997,316.09066550360001]
[null,null,"s2U","2",260.26697999999999,260.04669223909997]
[null,null,"mcm5s2U","3",332.32963999999998,332.06782161129996]
[null,null,"s4U","4",260.26697999999999,260.04669223909997]
[null,null,"mo5U","5",274.22735999999998,274.08010081750001]
[null,null,"t6A","6",412.35470000000004,412.13426166080001]
[null,null,"m7G","7",297.26730000000003,297.10731862699998]
[null,null,"manQ","8",571.53441999999995,571.21257155730007]
[null,null,"galQ","9",571.53441999999995,571.21257155730007]
[null,null,"D","D",246.21725999999998,246.08518619519998]
[null,null,"m6t6A","E",426.38128,426.14991172460003]
[null,null,"m5s2U","F",274.29356000000001,274.06234230289999]
[null,null,"I","I",268.22608000000002,268.08076952390002]
[null,null,"m1G","K",297.26730000000003,297.10731862699998]
[null,null,"m2G","L",297.26730000000003,297.10731862699998]
[null,null,"ac4C","M",285.25330000000002,285.09608523449998]
[null,null,"m1I","O",282.25266000000005,282.09641958769998]
[null,null,"Y","P",244.20138,244.06953613140001,"ψ"]
[null,null,"Q","Q",409.39382000000001,409.15974812679997]
[null,null,"m2,2G","R",311.29388,311.12296869080001]
[null,null,"mnm5s2U","S",303.33478000000002,303.08889140599996]
[null,null,"cmo5U","V",318.23685999999998,318.06993006209996]
[null,null,"o2yW","W",540.48062000000004,540.18160578289996]
[null,null,"acp3U","X",345.30525999999998,345.11721460669997]
[null,null,"yW","Y",508.48181999999997,508.19177653829996]
[null,null,"Ym","Z",258.22796,258.08518619519998,"ψm"]
[null,null,"L","}",371.38890000000004,371.18048356829996,"k2C"]
[null,null,"ncm5U","&",301.2527,301.09099985680001]
[null,null,"G+","(",324.29264000000001,324.11821766629998]
[]
[null,"以下は","imG","À",335.31528000000003,335.12296869080001]
[null,"拡張１文字表記","mimG","Á",349.34186000000005,349.13861875459997]
[null,"外では通用しない","m6,6A","Â",295.29448000000002,295.12805406849998,"m62A"]
[null,"ので注意","m1acp3Y","Ã",359.33184,359.1328646705,"m1acp3Ψ"]
[null,null,"hm5C","Ä",273.24259999999998,273.09608523449998]
[null,null,"hm5Cm","Å",287.26918000000001,287.1117352983]
[null,null,"tm5U","@",381.35895999999997,381.08419995899993,"τm5U"]
[null,null,"tm5s2U","H",397.42455999999999,397.0613560667,"τm5s2U"]
[null,null,"ava2C","Æ",341.36292000000003,341.16991888219997,"N341"]
[null,null,"ho5U","∝",260.20078000000001,260.06445075369999]
[null,null,"Ur","Ç",192.16988000000001,192.07462150909998,"U-52, ribosylurea"]
[null,null,"cm5U","◊",302.23746,302.07501543979998]
[null,null,"m4Cm","Ò",271.26978000000003,271.11682067599997]
[null,null,"m3U","Õ",258.22796,258.08518619519998]
[null,null,"ct6A","Ï",394.33942000000002,394.12369697469995]
[null,null,"ca5C","Ñ",287.22612000000004,287.07534979299999]

{"sheet":"tables","index":3,"n_rows":25,"n_cols":14,"rows_kept":25,"cut":false,"hidden":false,"merged":[]}
[null,null,null,null,null,"http://www.riken.jp/BiomolChar/Aminoacidmolecularmasses_J.html"]
[null,null,"アミノ酸残基精密質量表 (アミノ酸-H2O)",null,null,null,"水を引いてある"]
[null,null,"アミノ酸残基","略号","一文字表記","組成式","平均質量(u)","単同位体精密質量（u","MW calculator",null,null,"チオウリジンのバリエーション",null,"monoisotoic mass (z=0)"]
[null,null,"グリシン","Gly","G","C2H3NO",57.051000000000002,57.02146372,57.021462800000002,null,null,"チオ","sU",260.04669223909997]
[null,null,"アラニン","Ala","A","C3H5NO",71.078000000000003,71.037113779999999,71.037111999999993,null,null,"ウリジン","U",244.06953613140001]
[null,null,"セリン","Ser","S","C3H5NO2",87.076999999999998,87.032028400000002,null,null,null,"酸化的脱硫黄化","h2U (-O)",228.07462150909998]
[null,null,"プロリン","Pro","P","C5H7NO",97.114999999999995,97.052763850000005,null,null,null,"<酸化の中間体>"]
[null,null,"バリン","Val","V","C5H9NO",99.131,99.068413910000004,null,null,null,"スルフェン酸 / S-oxide","+O",276.0416068614]
[null,null,"トレオニン","Thr","T","C4H7NO2",101.104,101.04767846999999,null,null,null,null,"+H2O",278.05725692519997]
[null,null,"システイン","Cys","C","C3H5NOS",103.143,103.00918478,null,null,null,null,"+H2O2",294.0521715475]
[null,null,"イソロイシン","Ile","I","C6H11NO",113.158,113.08406398,null,null,null,"スルフィン酸","+2O",292.03652148369997]
[null,null,"ロイシン","Leu","L","C6H11NO",113.158,113.08406398,null,null,null,"スルホン酸","+3O",308.031436106]
[null,null,"アスパラギン","Asn","N","C4H6N2O2",114.10299999999999,114.04292744]
[null,null,"アスパラギン酸","Asp","D","C4H5NO3",115.087,115.02694302]
[null,null,"グルタミン","Gln","Q","C5H8N2O2",128.12899999999999,128.05857750999999]
[null,null,"リジン","Lys","K","C6H12N2O",128.172,128.09496300999999]
[null,null,"グルタミン酸","Glu","E","C5H7NO3",129.114,129.04259309]
[null,null,"メチオニン","Met","M","C5H9NOS",131.196,131.04048491]
[null,null,"ヒスチジン","His","H","C6H7N3O",137.13900000000001,137.05891185999999]
[null,null,"フェニルアラニン","Phe","F","C9H9NO",147.17400000000001,147.06841391]
[null,null,"アルギニン","Arg","R","C6H12N4O",156.18600000000001,156.10111101999999]
[null,null,"チロシン","Tyr","Y","C9H9NO2",163.173,163.06332853000001]
[null,null,"トリプトファン","Trp","W","C11H10N2O",186.21,186.07931295]
[]
[null,null,"f-Met","fMet",null,"C6H9NO2S",159.2072,159.03539739999999]